[riscv-reports] [#130566] sisyphus_riscv64 FAILED srpm=python3-module-hypothesis-6.155.7-alt1.src.rpm ...
Girar sisyphus_riscv64 awaiter recycler
noreply at basealt.ru
Sun Jun 28 04:25:43 MSK 2026
http://web.build.srt.basealt.ru/tasks/130566/logs/events.1.1.log
subtask name riscv64
#100 python3-module-hypothesis 7:32
#200 python3-module-anyio failed
2026-Jun-28 01:09:24 :: shared task #130566 for sisyphus_riscv64 started by recycler:
2026-Jun-28 01:09:24 :: message: sync
#100 build python3-module-hypothesis-6.155.7-alt1.src.rpm
#200 build python3-module-anyio-4.14.1-alt1.src.rpm
#300 build python3-module-detect-installer-0.1.0-alt1.5.g47fdb25.src.rpm
#400 build python3-module-rignore-0.7.6-alt1.src.rpm
2026-Jun-28 01:09:24 :: created build repo
2026-Jun-28 01:09:29 :: [riscv64] #100 python3-module-hypothesis-6.155.7-alt1.src.rpm: build start
2026-Jun-28 01:17:01 :: [riscv64] #100 python3-module-hypothesis-6.155.7-alt1.src.rpm: build OK
2026-Jun-28 01:17:02 :: [riscv64] #200 python3-module-anyio-4.14.1-alt1.src.rpm: build start
[riscv64] SKIPPED [6] tests/test_taskgroups.py:2011: Requires Python 3.14
[riscv64] FAILED tests/test_pytest_plugin.py::test_dynamic_async_fixture_access_does_not_hang
[riscv64] = 1 failed, 2587 passed, 62 skipped, 5 xfailed, 4 xpassed in 346.63s (0:05:46) =
[riscv64] INFO : Command's result: FAILURE
[riscv64] INFO : Command's error: Command '['python3', '-m', 'pytest', '-Wignore', '-m', 'not network', '--ignore=tests/test_sockets.py']' returned non-zero exit status 1.
[riscv64] error: Bad exit status from /usr/src/tmp/rpmb-tmp.CKezAM (%check)
2026-Jun-28 01:25:42 :: [riscv64] python3-module-anyio-4.14.1-alt1.src.rpm: remote: build failed
2026-Jun-28 01:25:42 :: [riscv64] #200 python3-module-anyio-4.14.1-alt1.src.rpm: build FAILED
2026-Jun-28 01:25:43 :: [riscv64] requesting cancellation of task processing
2026-Jun-28 01:25:43 :: [riscv64] build FAILED
2026-Jun-28 01:25:43 :: task #130566 for sisyphus_riscv64 FAILED
More information about the Riscv-reports
mailing list