[riscv-reports] [#130542] sisyphus_riscv64 FAILED srpm=google-gson-2.14.0-alt1.src.rpm
Girar sisyphus_riscv64 awaiter recycler
noreply at basealt.ru
Sun Jun 28 02:40:55 MSK 2026
http://web.build.srt.basealt.ru/tasks/130542/logs/events.1.1.log
subtask name riscv64
#100 google-gson failed
2026-Jun-27 23:39:27 :: shared task #130542 for sisyphus_riscv64 started by recycler:
2026-Jun-27 23:39:27 :: message: sync
#100 build google-gson-2.14.0-alt1.src.rpm
2026-Jun-27 23:39:34 :: [riscv64] #100 google-gson-2.14.0-alt1.src.rpm: build start
[riscv64] <13>Jun 27 23:40:38 rpmi: javapackages-filesystem-1:6.4.1-alt3 sisyphus_riscv64+130095.200.1.1 1782386900 installed
[riscv64] <13>Jun 27 23:40:38 rpmi: slf4j-0:1.7.36-alt3 sisyphus_riscv64+130095.300.1.1 1782387210 installed
[riscv64] <13>Jun 27 23:40:38 rpmi: plexus-utils-4.0.2-alt1 sisyphus_riscv64+130095.1500.2.1 1782405959 installed
[riscv64] <13>Jun 27 23:40:38 rpmi: apache-commons-io-1:2.22.0-alt1 sisyphus_riscv64+130095.1200.1.1 1782390928 installed
[riscv64] <13>Jun 27 23:40:38 rpmi: atinject-0:1.0.5-alt2 sisyphus_riscv64+98332.300.1.1 1761513932 installed
[riscv64] <13>Jun 27 23:40:38 rpmi: apache-commons-lang3-3.20.0-alt1 sisyphus_riscv64+130095.1300.1.1 1782391233 installed
[riscv64] <13>Jun 27 23:40:38 rpmi: maven-shared-utils-3.4.2-alt1 sisyphus_riscv64+93172.100.1.1 1756295004 installed
[riscv64] <13>Jun 27 23:40:38 rpmi: plexus-xml-3.0.2-alt1 sisyphus_riscv64+111806.500.1.1 1771999026 installed
[riscv64] <13>Jun 27 23:40:38 rpmi: jcl-over-slf4j-0:1.7.36-alt3 sisyphus_riscv64+130095.300.1.1 1782387210 installed
[riscv64] <13>Jun 27 23:40:38 rpmi: jsch-agent-proxy-core-0.0.8-alt1_15jpp11 sisyphus_riscv64+85040.600.2.1 1748816482 installed
[riscv64] <13>Jun 27 23:40:38 rpmi: plexus-containers-component-annotations-2.2.0-alt1 sisyphus_riscv64+130095.2000.2.1 1782406780 installed
[riscv64] <13>Jun 27 23:40:38 rpmi: plexus-interpolation-1.28-alt2 sisyphus_riscv64+112557.100.1.1 1772462102 installed
[riscv64] <13>Jun 27 23:40:38 rpmi: javapackages-tools-1:6.4.1-alt3 sisyphus_riscv64+130095.200.1.1 1782386900 installed
[riscv64] <13>Jun 27 23:40:39 rpmi: bouncycastle-0:1.80-alt1 sisyphus_riscv64+110305.300.2.1 1771005211 installed
[riscv64] <13>Jun 27 23:40:39 rpmi: plexus-classworlds-2.9.0-alt1 sisyphus_riscv64+92791.400.3.1 1756293282 installed
[riscv64] <13>Jun 27 23:40:39 rpmi: sisu-2:0.9.0.M3-alt2 sisyphus_riscv64+130095.1700.2.1 1782406517 installed
[riscv64] <13>Jun 27 23:40:39 rpmi: plexus-cipher-2.0-alt1_2jpp11 sisyphus_riscv64+84749.400.2.1 1748588906 installed
[riscv64] <13>Jun 27 23:40:39 rpmi: plexus-sec-dispatcher-2.0-alt1 sisyphus_riscv64+84749.1200.2.1 1748590632 installed
[riscv64] <13>Jun 27 23:40:39 rpmi: aopalliance-0:1.0-alt6_24jpp11 sisyphus_riscv64+85128.2500.2.1 1748885468 installed
[riscv64] <13>Jun 27 23:40:39 rpmi: jakarta-annotations-3.0.0-alt1 sisyphus_riscv64+105284.100.1.1 1766650038 installed
[riscv64] <13>Jun 27 23:40:39 rpmi: httpcomponents-core-4.4.16-alt1 sisyphus_riscv64+113086.200.1.1 1772704127 installed
[riscv64] <13>Jun 27 23:40:39 rpmi: apiguardian-1.1.2-alt2 sisyphus_riscv64+101124.600.3.1 1766045348 installed
[riscv64] <13>Jun 27 23:40:39 rpmi: jna-5.18.1-alt1 sisyphus_riscv64+113086.500.1.1 1772705681 installed
[riscv64] <13>Jun 27 23:40:40 rpmi: jna-contrib-5.18.1-alt1 sisyphus_riscv64+113086.500.1.1 1772705681 installed
[riscv64] <13>Jun 27 23:40:40 rpmi: bouncycastle-pg-0:1.80-alt1 sisyphus_riscv64+110305.300.2.1 1771005211 installed
[riscv64] <13>Jun 27 23:40:40 rpmi: bouncycastle-util-0:1.80-alt1 sisyphus_riscv64+110305.300.2.1 1771005211 installed
[riscv64] <13>Jun 27 23:40:40 rpmi: bouncycastle-pkix-0:1.80-alt1 sisyphus_riscv64+110305.300.2.1 1771005211 installed
[riscv64] <13>Jun 27 23:40:40 rpmi: maven-file-management-1:3.2.0-alt1 sisyphus_riscv64+129354.100.1.1 1781804540 installed
[riscv64] <13>Jun 27 23:40:40 rpmi: apache-commons-cli-1.11.0-alt1 sisyphus_riscv64+130095.1000.1.1 1782390388 installed
[riscv64] <13>Jun 27 23:40:40 rpmi: apache-commons-codec-1.22.0-alt1 sisyphus_riscv64+130095.1100.1.1 1782390637 installed
[riscv64] <13>Jun 27 23:40:40 rpmi: apache-commons-compress-1.27.1-alt2 sisyphus_riscv64+126867.2000.1.1 1779832348 installed
[riscv64] <13>Jun 27 23:40:40 rpmi: jzlib-0:1.1.3-alt1_21jpp11 sisyphus_riscv64+85128.12500.2.1 1748904759 installed
[riscv64] <13>Jun 27 23:40:40 rpmi: jsch-0:0.1.55-alt1_7jpp11 sisyphus_riscv64+85128.14400.2.1 1748909341 installed
[riscv64] <13>Jun 27 23:40:40 rpmi: jetty-util-9.4.58-alt1 sisyphus_riscv64+116979.100.1.1 1774894053 installed
[riscv64] <13>Jun 27 23:40:40 rpmi: jansi-0:2.4.0-alt2 sisyphus_riscv64+99803.200.1.1 1762377779 installed
[riscv64] <13>Jun 27 23:40:40 rpmi: xmvn-core-4.2.0-alt3 sisyphus_riscv64+130095.400.1.1 1782387571 installed
[riscv64] <13>Jun 27 23:40:40 rpmi: plexus-interactivity-1.5.1-alt1 sisyphus_riscv64+111806.1400.1.1 1772000694 installed
[riscv64] <13>Jun 27 23:40:40 rpmi: libgdbm6-1.26-alt1 sisyphus_riscv64+126243.100.1.1 1779345791 installed
[riscv64] <13>Jun 27 23:40:40 rpmi: libgdbm_compat4-1.26-alt1 sisyphus_riscv64+126243.100.1.1 1779345791 installed
[riscv64] <13>Jun 27 23:40:40 rpmi: jetty-io-9.4.58-alt1 sisyphus_riscv64+116979.100.1.1 1774894053 installed
[riscv64] <13>Jun 27 23:40:40 rpmi: jetty-http-9.4.58-alt1 sisyphus_riscv64+116979.100.1.1 1774894053 installed
[riscv64] <13>Jun 27 23:40:40 rpmi: jetty-util-ajax-9.4.58-alt1 sisyphus_riscv64+116979.100.1.1 1774894053 installed
[riscv64] <13>Jun 27 23:40:40 rpmi: jsch-agent-proxy-jsch-0.0.8-alt1_15jpp11 sisyphus_riscv64+85040.600.2.1 1748816482 installed
[riscv64] <13>Jun 27 23:40:40 rpmi: jsch-agent-proxy-pageant-0.0.8-alt1_15jpp11 sisyphus_riscv64+85040.600.2.1 1748816482 installed
[riscv64] <13>Jun 27 23:40:40 rpmi: jsch-agent-proxy-usocket-jna-0.0.8-alt1_15jpp11 sisyphus_riscv64+85040.600.2.1 1748816482 installed
[riscv64] <13>Jun 27 23:40:40 rpmi: google-gson-2.9.1-alt1_1jpp11 sisyphus_riscv64+85128.17400.2.1 1748916127 installed
[riscv64] <13>Jun 27 23:40:40 rpmi: jsch-agent-proxy-sshagent-0.0.8-alt1_15jpp11 sisyphus_riscv64+85040.600.2.1 1748816482 installed
[riscv64] <13>Jun 27 23:40:40 rpmi: jsch-agent-proxy-usocket-nc-0.0.8-alt1_15jpp11 sisyphus_riscv64+85040.600.2.1 1748816482 installed
[riscv64] <13>Jun 27 23:40:40 rpmi: jsch-agent-proxy-connector-factory-0.0.8-alt1_15jpp11 sisyphus_riscv64+85040.600.2.1 1748816482 installed
[riscv64] <13>Jun 27 23:40:40 rpmi: plexus-compiler-2.16.2-alt1 sisyphus_riscv64+111806.1000.1.1 1771999717 installed
[riscv64] <13>Jun 27 23:40:40 rpmi: apache-commons-text-1.15.0-alt1 sisyphus_riscv64+106383.100.1.1 1768074561 installed
[riscv64] <13>Jun 27 23:40:40 rpmi: plexus-io-3.6.0-alt2 sisyphus_riscv64+130095.1600.2.1 1782406196 installed
[riscv64] <13>Jun 27 23:40:40 rpmi: apache-commons-net-3.13.0-alt1 sisyphus_riscv64+126867.500.1.1 1779829397 installed
[riscv64] <13>Jun 27 23:40:40 rpmi: plexus-build-api0-0:0.0.7-alt5 sisyphus_riscv64+130066.100.1.1 1782375314 installed
[riscv64] <13>Jun 27 23:40:40 rpmi: maven-filtering-3.4.0-alt1 sisyphus_riscv64+111806.2000.1.1 1772001697 installed
[riscv64] <13>Jun 27 23:40:41 rpmi: ant-lib-1.10.15-alt3 sisyphus_riscv64+130095.700.1.1 1782390145 installed
[riscv64] <13>Jun 27 23:40:41 rpmi: args4j-2.33-alt1_19jpp11 sisyphus_riscv64+85128.10500.2.1 1748900535 installed
[riscv64] <13>Jun 27 23:40:41 rpmi: javaewah-1.1.13-alt1_3jpp11 sisyphus_riscv64+85128.12200.2.1 1748904063 installed
[riscv64] <13>Jun 27 23:40:41 rpmi: ed25519-java-0.3.0-alt2 sisyphus_riscv64+111053.100.1.1 1771355439 installed
[riscv64] <13>Jun 27 23:40:41 rpmi: jakarta-servlet-5.0.0-alt1_8jpp11 sisyphus_riscv64+16395.100.1.1 1643911954 installed
[riscv64] <13>Jun 27 23:40:41 rpmi: jetty-server-9.4.58-alt1 sisyphus_riscv64+116979.100.1.1 1774894053 installed
[riscv64] <13>Jun 27 23:40:41 rpmi: jetty-security-9.4.58-alt1 sisyphus_riscv64+116979.100.1.1 1774894053 installed
[riscv64] <13>Jun 27 23:40:41 rpmi: jetty-servlet-9.4.58-alt1 sisyphus_riscv64+116979.100.1.1 1774894053 installed
[riscv64] <13>Jun 27 23:40:41 rpmi: univocity-parsers-2.9.1-alt1_6jpp11 sisyphus_riscv64+85128.100.1.1 1748873988 installed
[riscv64] <13>Jun 27 23:40:41 rpmi: hamcrest-3.0-alt1 sisyphus_riscv64+101124.400.2.1 1766042934 installed
[riscv64] <13>Jun 27 23:40:41 rpmi: junit-1:4.13.1-alt2 sisyphus_riscv64+101124.500.2.1 1766043203 installed
[riscv64] <13>Jun 27 23:40:41 rpmi: opentest4j-1.3.0-alt1 sisyphus_riscv64+99309.200.1.1 1761903961 installed
[riscv64] <13>Jun 27 23:40:41 rpmi: objectweb-asm-9.9-alt1 sisyphus_riscv64+104546.200.2.1 1766045906 installed
[riscv64] <13>Jun 27 23:40:41 rpmi: asm-jdk-bridge-0.0.13-alt1 sisyphus_riscv64+104552.100.1.1 1766046466 installed
[riscv64] <13>Jun 27 23:40:41 rpmi: byte-buddy-1.18.0-alt2 sisyphus_riscv64+130346.100.1.1 1782547564 installed
[riscv64] <13>Jun 27 23:40:42 rpmi: assertj-core-3.27.3-alt1 sisyphus_riscv64+93172.200.1.1 1756295527 installed
[riscv64] <13>Jun 27 23:40:42 rpmi: junit5-5.10.2-alt2 sisyphus_riscv64+101124.700.3.1 1766045644 installed
[riscv64] <13>Jun 27 23:40:42 rpmi: beust-jcommander-3.0-alt2 sisyphus_riscv64+99531.100.1.1 1762021638 installed
[riscv64] <13>Jun 27 23:40:42 rpmi: xmvn-tools-4.2.0-alt3 sisyphus_riscv64+130095.400.1.1 1782387571 installed
[riscv64] <13>Jun 27 23:40:42 rpmi: jsr-305-1:3.0.2-alt3 sisyphus_riscv64+127217.100.1.1 1780057560 installed
[riscv64] <13>Jun 27 23:40:42 rpmi: guava-31.0.1-alt2_3jpp11 sisyphus_riscv64+84749.1300.2.1 1748591240 installed
[riscv64] <13>Jun 27 23:40:42 rpmi: google-guice-5.1.0-alt5 sisyphus_riscv64+130095.600.1.1 1782389175 installed
[riscv64] <13>Jun 27 23:40:42 rpmi: xz-java-1.10-alt1 sisyphus_riscv64+91737.100.1.1 1754641300 installed
[riscv64] <13>Jun 27 23:40:42 rpmi: plexus-archiver-4.11.0-alt2 sisyphus_riscv64+117545.200.1.2 1775150734 installed
[riscv64] <13>Jun 27 23:40:42 rpmi: maven-plugin-testing-harness-3.3.0-alt2 sisyphus_riscv64+85097.1400.1.1 1748863152 installed
[riscv64] <13>Jun 27 23:40:42 rpmi: maven-archiver-3.6.2-alt1 sisyphus_riscv64+111806.1500.1.1 1772000953 installed
[riscv64] <13>Jun 27 23:40:42 rpmi: qdox-1:2.0.0-alt1_9jpp11 sisyphus_riscv64+85128.4100.2.1 1748889786 installed
[riscv64] <13>Jun 27 23:40:42 rpmi: plexus-languages-1.5.2-alt1 sisyphus_riscv64+111806.1100.1.1 1771999966 installed
[riscv64] <13>Jun 27 23:40:42 rpmi: libxml2-1:2.12.10-alt3 sisyphus_riscv64+106871.100.1.1 1768511693 installed
[riscv64] <13>Jun 27 23:40:42 rpmi: libxslt-1.1.43-alt1 sisyphus_riscv64+98697.100.1.1 1761621654 installed
[riscv64] <13>Jun 27 23:40:42 rpmi: rpm-macros-java-1:6.4.1-alt3 sisyphus_riscv64+130095.200.1.1 1782386900 installed
[riscv64] <13>Jun 27 23:40:43 rpmi: jurand-1.3.5-alt2 sisyphus_riscv64+76163.100.1.1 1741953691 installed
[riscv64] <13>Jun 27 23:40:43 rpmi: rpm-macros-jurand-1.3.5-alt2 sisyphus_riscv64+76163.100.1.1 1741953691 installed
[riscv64] <13>Jun 27 23:40:43 rpmi: libsqlite3-3.50.4-alt1 sisyphus_riscv64+91443.100.1.1 1754555936 installed
[riscv64] <13>Jun 27 23:40:43 rpmi: libmpdec3-2.5.1-alt3 sisyphus_riscv64+29035.100.1.1 1675621702 installed
[riscv64] <13>Jun 27 23:40:43 rpmi: libexpat-2.7.4-alt1 sisyphus_riscv64+109313.100.1.1 1770323898 installed
[riscv64] <13>Jun 27 23:40:43 rpmi: openssl-config-3.5.0-alt1 sisyphus_riscv64+99925.100.1.1 1762587030 installed
[riscv64] <13>Jun 27 23:40:43 rpmi: libb2-0.98.1-alt1_1 sisyphus_riscv64+13721.100.1.1 1638969645 installed
[riscv64] <13>Jun 27 23:40:43 rpmi: libp11-kit-1:0.26.2-alt2.g5e81ed3 sisyphus_riscv64+130519.100.1.1 1782598472 installed
[riscv64] <13>Jun 27 23:40:43 rpmi: libtasn1-4.21.0-alt2 sisyphus_riscv64+128673.100.1.1 1781194651 installed
[riscv64] <13>Jun 27 23:40:43 rpmi: publicsuffix-list-20260302-alt1 sisyphus_riscv64+113004.100.1.1 1772666916 installed
[riscv64] <13>Jun 27 23:40:43 rpmi: httpcomponents-client-4.5.14-alt2 sisyphus_riscv64+120302.100.1.1 1778160479 installed
[riscv64] <13>Jun 27 23:40:43 rpmi: jgit-5.11.0-alt2 sisyphus_riscv64+113086.400.1.1 1772705287 installed
[riscv64] <13>Jun 27 23:40:43 rpmi: apache-sshd-1:2.17.1-alt1 sisyphus_riscv64+112290.200.1.1 1772225878 installed
[riscv64] <13>Jun 27 23:40:43 rpmi: maven-scm-2.2.1-alt1 sisyphus_riscv64+112752.100.2.1 1774428966 installed
[riscv64] <13>Jun 27 23:40:44 rpmi: maven-wagon-3.5.3-alt4 sisyphus_riscv64+126867.2100.1.1 1779832635 installed
[riscv64] <13>Jun 27 23:40:44 rpmi: maven-resolver-1:1.6.3-alt2 sisyphus_riscv64+103318.100.1.1 1765284770 installed
[riscv64] <13>Jun 27 23:40:44 rpmi: xmvn-minimal-4.2.0-alt3 sisyphus_riscv64+130095.400.1.1 1782387571 installed
[riscv64] <13>Jun 27 23:40:44 rpmi: maven-lib-1:3.8.8-alt5 sisyphus_riscv64+130095.500.1.1 1782388088 installed
[riscv64] <13>Jun 27 23:40:44 rpmi: maven-1:3.8.8-alt5 sisyphus_riscv64+130095.500.1.1 1782388088 installed
[riscv64] <13>Jun 27 23:40:44 rpmi: maven-shared-incremental-1.1-alt1_23jpp11 sisyphus_riscv64+85097.1000.1.1 1748862247 installed
[riscv64] <13>Jun 27 23:40:44 rpmi: maven-compiler-plugin-3.14.0-alt1 sisyphus_riscv64+93170.500.2.1 1756466145 installed
[riscv64] <13>Jun 27 23:40:44 rpmi: maven-jar-plugin-3.2.2-alt1_2jpp11 sisyphus_riscv64+84904.1500.1.1 1748684233 installed
[riscv64] <13>Jun 27 23:40:44 rpmi: maven-resources-plugin-3.2.0-alt1_4jpp11 sisyphus_riscv64+84904.1200.1.1 1748683476 installed
[riscv64] <13>Jun 27 23:40:44 rpmi: maven-common-artifact-filters-3.4.0-alt1 sisyphus_riscv64+111806.1600.1.1 1772001218 installed
[riscv64] <13>Jun 27 23:40:44 rpmi: maven-surefire-0:3.2.2-alt2 sisyphus_riscv64+100644.300.1.1 1763113185 installed
[riscv64] <13>Jun 27 23:40:44 rpmi: maven-surefire-provider-junit-0:3.2.2-alt2 sisyphus_riscv64+100644.300.1.1 1763113185 installed
[riscv64] <13>Jun 27 23:40:44 rpmi: maven-surefire-provider-junit5-0:3.2.2-alt2 sisyphus_riscv64+100644.300.1.1 1763113185 installed
[riscv64] <13>Jun 27 23:40:44 rpmi: maven-surefire-provider-testng-0:3.2.2-alt2 sisyphus_riscv64+100644.300.1.1 1763113185 installed
[riscv64] <13>Jun 27 23:40:44 rpmi: maven-surefire-plugin-0:3.2.2-alt2 sisyphus_riscv64+100644.300.1.1 1763113185 installed
[riscv64] <13>Jun 27 23:40:44 rpmi: xmvn-mojo-4.2.0-alt3 sisyphus_riscv64+130095.400.1.1 1782387571 installed
[riscv64] <13>Jun 27 23:40:44 rpmi: rpm-macros-alternatives-0.5.3-alt1 sisyphus_riscv64+71244.100.1.1 1738025117 installed
[riscv64] <13>Jun 27 23:40:44 rpmi: alternatives-0.5.3-alt1 sisyphus_riscv64+71244.100.1.1 1738025117 installed
[riscv64] <13>Jun 27 23:40:44 rpmi: ca-certificates-2026.04.22-alt1 sisyphus_riscv64+124784.100.1.1 1778294417 installed
[riscv64] <13>Jun 27 23:40:44 rpmi: ca-trust-0.2.0-alt1 sisyphus_riscv64+47419.100.1.1 1712764300 installed
[riscv64] <13>Jun 27 23:40:44 rpmi: p11-kit-trust-1:0.26.2-alt2.g5e81ed3 sisyphus_riscv64+130519.100.1.1 1782598472 installed
[riscv64] <13>Jun 27 23:40:44 rpmi: libcrypto3-3.5.4-alt1 sisyphus_riscv64+99925.200.1.1 1762591620 installed
[riscv64] <13>Jun 27 23:40:44 rpmi: libssl3-3.5.4-alt1 sisyphus_riscv64+99925.200.1.1 1762591620 installed
[riscv64] <13>Jun 27 23:40:45 rpmi: python3-3.13.13-alt1 sisyphus_riscv64+126585.100.1.2 1779657200 installed
[riscv64] <13>Jun 27 23:40:45 rpmi: python3-modules-sqlite3-3.13.13-alt1 sisyphus_riscv64+126585.100.1.2 1779657200 installed
[riscv64] <13>Jun 27 23:40:46 rpmi: python3-base-3.13.13-alt1 sisyphus_riscv64+126585.100.1.2 1779657200 installed
[riscv64] <13>Jun 27 23:40:46 rpmi: python3-module-cssselect-1.4.0-alt1.1 sisyphus_riscv64+116970.200.1.1 1774891857 installed
[riscv64] <13>Jun 27 23:40:46 rpmi: python3-module-genshi-0.7.10-alt1 sisyphus_riscv64+108145.100.1.1 1769450278 installed
[riscv64] <13>Jun 27 23:40:47 rpmi: python3-module-six-1.17.0-alt1.1 sisyphus_riscv64+72388.100.1.1 1738957031 installed
[riscv64] <13>Jun 27 23:40:47 rpmi: python3-module-webencodings-0.5.1-alt3 sisyphus_riscv64+54276.100.1.1 1728411577 installed
[riscv64] <13>Jun 27 23:40:47 rpmi: python3-module-html5lib-1:1.1-alt1 sisyphus_riscv64+9885.100.2.1 1635066927 installed
[riscv64] <13>Jun 27 23:40:47 rpmi: python3-module-lxml-6.0.2-alt1 sisyphus_riscv64+107637.100.1.1 1769149480 installed
[riscv64] <13>Jun 27 23:40:47 rpmi: python3-module-javapackages-1:6.4.1-alt3 sisyphus_riscv64+130095.200.1.1 1782386900 installed
[riscv64] <13>Jun 27 23:40:47 rpmi: rpm-build-java-1:6.4.1-alt3 sisyphus_riscv64+130095.200.1.1 1782386900 installed
[riscv64] <13>Jun 27 23:40:47 rpmi: javapackages-local-1:6.4.1-alt3 sisyphus_riscv64+130095.200.1.1 1782386900 installed
[riscv64] <13>Jun 27 23:40:47 rpmi: maven-local-1:6.4.1-alt3 sisyphus_riscv64+130095.200.1.1 1782386900 installed
[riscv64] Reading Package Lists...
[riscv64] Building Dependency Tree...
[riscv64] MI2a: marked for install (shallow): jpackage-default
[riscv64] MI2a: satisfying Depends: jpackage-17-compat = 0.44-alt1:sisyphus_riscv64+130095.100.1.1
[riscv64] MI2a: maybe install (a direct target): jpackage-17-compat 0.44-alt1:sisyphus_riscv64+130095.100.1.1 at 1782386692
[riscv64] MI2a: target SELECTED: jpackage-17-compat 0.44-alt1:sisyphus_riscv64+130095.100.1.1 at 1782386692
[riscv64] MI2a: requesting to install jpackage-17-compat (unspec'd ver; inspect with Debug::pkgMark-shallow)
[riscv64] MI2a: marked for install (shallow): jpackage-17-compat
[riscv64] MI2a: satisfying PreDepends: java-17-openjdk-devel (NULL)
[riscv64] MI2a: maybe install (a direct target): java-17-openjdk-devel 0:17.0.18.0.8-alt2:sisyphus_riscv64+108410.100.1.1 at 1769534402
[riscv64] MI2a: target SELECTED: java-17-openjdk-devel 0:17.0.18.0.8-alt2:sisyphus_riscv64+108410.100.1.1 at 1769534402
[riscv64] MI2a: requesting to install java-17-openjdk-devel (unspec'd ver; inspect with Debug::pkgMark-shallow)
[riscv64] MI2a: marked for install (shallow): java-17-openjdk-devel
[riscv64] MI2a: satisfying Depends: java-17-openjdk = 0:17.0.18.0.8-alt2:sisyphus_riscv64+108410.100.1.1
[riscv64] MI2a: maybe install (a direct target): java-17-openjdk 0:17.0.18.0.8-alt2:sisyphus_riscv64+108410.100.1.1 at 1769534402
[riscv64] MI2a: target SELECTED: java-17-openjdk 0:17.0.18.0.8-alt2:sisyphus_riscv64+108410.100.1.1 at 1769534402
[riscv64] MI2a: requesting to install java-17-openjdk (unspec'd ver; inspect with Debug::pkgMark-shallow)
[riscv64] MI2a: marked for install (shallow): java-17-openjdk
[riscv64] MI2a: satisfying Depends: libX11.so.6()(64bit) >= set:ogpS11FhBpge7Ksjj8xachMwQKDxDYcurjUzZKnl3lwc2knhrA3m91630riT5Raz7KXFSIPbMeizgWSIlVI6ALRbyol7egc1S7FURwrG2Fg3NJnaa1uKQjuAPv6RaxkrcRlkHRRApNma2hI3eV8eiquD4LrCkqBSwh21HiLHzEu41wxS6YEC5LUyod8pZD5UKVTjYJhdV850GProafgeLBsD6wZ5dYF6Scg8ocIhDRLpDYNTReAWc0X1BHCIBoh9cKxQsTZl2J8b9oV1XZ4kVNZuWsi5plCGZ44YaO1D0esfFS2dGgmxHdhlO5au0ToTMNRo7wBEf5KQeGqz6P7f6FZljTRsZiJHVFncRvZEhA131vJXQVxODZ6AkUBbnanWB24e2l0FyHqe66Z0aQUo3hVK3HHumlC5WYMBkJJL2RvgxjAbvZ0baLh5WVV74AlA2iZeL7NXnLfBe5XI29aQj7YRTpQYuTqzoD0
[riscv64] MI2a: maybe install (a providing target): libX11 3:1.8.13-alt1:sisyphus_riscv64+110010.100.1.1 at 1770694923
[riscv64] MI2a: target SELECTED: libX11 3:1.8.13-alt1:sisyphus_riscv64+110010.100.1.1 at 1770694923
[riscv64] MI2a: requesting to install libX11 (unspec'd ver; inspect with Debug::pkgMark-shallow)
[riscv64] MI2a: marked for install (shallow): libX11
[riscv64] MI2a: satisfying Depends: libxcb.so.1()(64bit) >= set:ni0Q79T9m8c8LtIHEZvE2to7CMOpYYJtPQlu1To9g36rmZ7fk1
[riscv64] MI2a: maybe install (a providing target): libxcb 1.17.0-alt1:sisyphus_riscv64+47651.200.1.1 at 1713376021
[riscv64] MI2a: target SELECTED: libxcb 1.17.0-alt1:sisyphus_riscv64+47651.200.1.1 at 1713376021
[riscv64] MI2a: requesting to install libxcb (unspec'd ver; inspect with Debug::pkgMark-shallow)
[riscv64] MI2a: marked for install (shallow): libxcb
[riscv64] MI2a: satisfying Depends: libXau.so.6()(64bit) >= set:ge34k81
[riscv64] MI2a: maybe install (a providing target): libXau 1.0.11-alt1:sisyphus_riscv64+26806.100.1.1 at 1670595777
[riscv64] MI2a: target SELECTED: libXau 1.0.11-alt1:sisyphus_riscv64+26806.100.1.1 at 1670595777
[riscv64] MI2a: requesting to install libXau (unspec'd ver; inspect with Debug::pkgMark-shallow)
[riscv64] MI2a: marked for install (shallow): libXau
[riscv64] MI2a: satisfying Depends: libXdmcp.so.6()(64bit) >= set:jiOzo
[riscv64] MI2a: maybe install (a providing target): libXdmcp 1.1.5-alt1:sisyphus_riscv64+46670.1000.1.1 at 1711473415
[riscv64] MI2a: target SELECTED: libXdmcp 1.1.5-alt1:sisyphus_riscv64+46670.1000.1.1 at 1711473415
[riscv64] MI2a: requesting to install libXdmcp (unspec'd ver; inspect with Debug::pkgMark-shallow)
[riscv64] MI2a: marked for install (shallow): libXdmcp
[riscv64] MI2a: satisfying Depends: libX11-locales = 3:1.8.13-alt1:sisyphus_riscv64+110010.100.1.1
[riscv64] MI2a: maybe install (a direct target): libX11-locales 3:1.8.13-alt1:sisyphus_riscv64+110010.100.1.1 at 1770694923
[riscv64] MI2a: target SELECTED: libX11-locales 3:1.8.13-alt1:sisyphus_riscv64+110010.100.1.1 at 1770694923
[riscv64] MI2a: requesting to install libX11-locales (unspec'd ver; inspect with Debug::pkgMark-shallow)
[riscv64] MI2a: marked for install (shallow): libX11-locales
[riscv64] MI2a: satisfying Depends: libXext.so.6()(64bit) >= set:lgTltHIIWWIyKBeJFVURXUengPi96OmoVV8meOpv2445kDWr9yoEuR5
[riscv64] MI2a: maybe install (a providing target): libXext 1.3.6-alt1:sisyphus_riscv64+46670.1100.1.1 at 1711473737
[riscv64] MI2a: target SELECTED: libXext 1.3.6-alt1:sisyphus_riscv64+46670.1100.1.1 at 1711473737
[riscv64] MI2a: requesting to install libXext (unspec'd ver; inspect with Debug::pkgMark-shallow)
[riscv64] MI2a: marked for install (shallow): libXext
[riscv64] MI2a: satisfying Depends: libXi.so.6()(64bit) >= set:kisnouS9
[riscv64] MI2a: maybe install (a providing target): libXi 1.8.3-alt1:sisyphus_riscv64+125991.100.1.1 at 1779218486
[riscv64] MI2a: target SELECTED: libXi 1.8.3-alt1:sisyphus_riscv64+125991.100.1.1 at 1779218486
[riscv64] MI2a: requesting to install libXi (unspec'd ver; inspect with Debug::pkgMark-shallow)
[riscv64] MI2a: marked for install (shallow): libXi
[riscv64] MI2a: satisfying Depends: libXrender.so.1()(64bit) >= set:jeLBBL6TEZg2gwEmMozjryGKMYZGZH8daXT9rk0
[riscv64] MI2a: maybe install (a providing target): libXrender 0.9.12-alt1:sisyphus_riscv64+71951.100.1.1 at 1738665677
[riscv64] MI2a: target SELECTED: libXrender 0.9.12-alt1:sisyphus_riscv64+71951.100.1.1 at 1738665677
[riscv64] MI2a: requesting to install libXrender (unspec'd ver; inspect with Debug::pkgMark-shallow)
[riscv64] MI2a: marked for install (shallow): libXrender
[riscv64] MI2a: satisfying Depends: libXtst.so.6()(64bit) >= set:ifZnZCgppA6f
[riscv64] MI2a: maybe install (a providing target): libXtst 1.2.4-alt1:sisyphus_riscv64+25114.1200.1.1 at 1666212118
[riscv64] MI2a: target SELECTED: libXtst 1.2.4-alt1:sisyphus_riscv64+25114.1200.1.1 at 1666212118
[riscv64] MI2a: requesting to install libXtst (unspec'd ver; inspect with Debug::pkgMark-shallow)
[riscv64] MI2a: marked for install (shallow): libXtst
[riscv64] MI2a: satisfying Depends: libgif.so.4()(64bit) >= set:jhe3DymTUk
[riscv64] MI2a: maybe install (a providing target): libgif 4.1.6-alt5:sisyphus_riscv64+124233.3000.2.1 at 1778579077
[riscv64] MI2a: target SELECTED: libgif 4.1.6-alt5:sisyphus_riscv64+124233.3000.2.1 at 1778579077
[riscv64] MI2a: requesting to install libgif (unspec'd ver; inspect with Debug::pkgMark-shallow)
[riscv64] MI2a: marked for install (shallow): libgif
[riscv64] MI2a: satisfying Depends: libpng16.so.16()(64bit) >= set:lgOKIQUxni0O7jU0z4ZwZmEpu5OIkKY0MrPrP8VdfWsPH6dI0NmUg8wvSs7f
[riscv64] MI2a: maybe install (a providing target): libpng16 1.6.56-alt2:sisyphus_riscv64+116624.100.1.1 at 1774644819
[riscv64] MI2a: target SELECTED: libpng16 1.6.56-alt2:sisyphus_riscv64+116624.100.1.1 at 1774644819
[riscv64] MI2a: requesting to install libpng16 (unspec'd ver; inspect with Debug::pkgMark-shallow)
[riscv64] MI2a: marked for install (shallow): libpng16
[riscv64] MI2a: satisfying Depends: java-17-openjdk-headless = 0:17.0.18.0.8-alt2:sisyphus_riscv64+108410.100.1.1
[riscv64] MI2a: maybe install (a direct target): java-17-openjdk-headless 0:17.0.18.0.8-alt2:sisyphus_riscv64+108410.100.1.1 at 1769534402
[riscv64] MI2a: target SELECTED: java-17-openjdk-headless 0:17.0.18.0.8-alt2:sisyphus_riscv64+108410.100.1.1 at 1769534402
[riscv64] MI2a: requesting to install java-17-openjdk-headless (unspec'd ver; inspect with Debug::pkgMark-shallow)
[riscv64] MI2a: marked for install (shallow): java-17-openjdk-headless
[riscv64] MI2a: satisfying Depends: tzdata-java >= 2020b
[riscv64] MI2a: maybe install (a providing target): javazi 2024a-alt1:sisyphus_riscv64+65626.100.1.1 at 1732652887
[riscv64] MI2a: target SELECTED: javazi 2024a-alt1:sisyphus_riscv64+65626.100.1.1 at 1732652887
[riscv64] MI2a: requesting to install javazi (unspec'd ver; inspect with Debug::pkgMark-shallow)
[riscv64] MI2a: marked for install (shallow): javazi
[riscv64] MI2a: satisfying Depends: java-common (NULL)
[riscv64] MI2a: maybe install (a direct target): java-common 1.7.0-alt1:sisyphus_riscv64+40308.100.1.1 at 1699094357
[riscv64] MI2a: target SELECTED: java-common 1.7.0-alt1:sisyphus_riscv64+40308.100.1.1 at 1699094357
[riscv64] MI2a: requesting to install java-common (unspec'd ver; inspect with Debug::pkgMark-shallow)
[riscv64] MI2a: marked for install (shallow): java-common
[riscv64] MI2a: satisfying Depends: /etc/pki/java/cacerts (NULL)
[riscv64] MI2a: maybe install (a providing target): ca-trust-java 0.2.0-alt1:sisyphus_riscv64+47419.100.1.1 at 1712764300
[riscv64] MI2a: target SELECTED: ca-trust-java 0.2.0-alt1:sisyphus_riscv64+47419.100.1.1 at 1712764300
[riscv64] MI2a: requesting to install ca-trust-java (unspec'd ver; inspect with Debug::pkgMark-shallow)
[riscv64] MI2a: marked for install (shallow): ca-trust-java
[riscv64] MI2a: satisfying Depends: libasound.so.2()(64bit) >= set:ohtarcYNVhFTZk1CjRZcUdrQkEUH80gOEBNwBsLZ1GjX5jf418NNxd5hOzvtM3gecW4GY9XGrlR990bG6bkXqxYmTjgURwMCO7IpYm8bxB2YMxacgnGl6dZwlXIuCNnghzpJNxk9xjajJGvILL2R4pq8Mu7aqXbaHwxZDyOS6y13NyL8v2RYC8n1k8omfcG9hpdXNlQ4PiAwlfAMjHlgXBjciy3QJbxHRm9s9MPLFiN7ZF6ZooSnz48uh2aeSyLrLvtRWZiJpoe5jfcijzmO2buQe1z9t1awQQ1YCY8ZCMV8iy5GCYvQaZuJETq1
[riscv64] MI2a: maybe install (a providing target): libalsa 1:1.2.15.3-alt1:sisyphus_riscv64+129200.200.1.1 at 1781635607
[riscv64] MI2a: target SELECTED: libalsa 1:1.2.15.3-alt1:sisyphus_riscv64+129200.200.1.1 at 1781635607
[riscv64] MI2a: requesting to install libalsa (unspec'd ver; inspect with Debug::pkgMark-shallow)
[riscv64] MI2a: marked for install (shallow): libalsa
[riscv64] MI2a: satisfying Depends: alsa-ucm-conf (NULL)
[riscv64] MI2a: maybe install (a direct target): alsa-ucm-conf 1.2.15.3-alt1:sisyphus_riscv64+129200.400.1.1 at 1781636132
[riscv64] MI2a: target SELECTED: alsa-ucm-conf 1.2.15.3-alt1:sisyphus_riscv64+129200.400.1.1 at 1781636132
[riscv64] MI2a: requesting to install alsa-ucm-conf (unspec'd ver; inspect with Debug::pkgMark-shallow)
[riscv64] MI2a: marked for install (shallow): alsa-ucm-conf
[riscv64] MI2a: satisfying Depends: alsa-topology-conf (NULL)
[riscv64] MI2a: maybe install (a direct target): alsa-topology-conf 1.2.5.1-alt1:sisyphus_riscv64+9152.100.1.1 at 1633924338
[riscv64] MI2a: target SELECTED: alsa-topology-conf 1.2.5.1-alt1:sisyphus_riscv64+9152.100.1.1 at 1633924338
[riscv64] MI2a: requesting to install alsa-topology-conf (unspec'd ver; inspect with Debug::pkgMark-shallow)
[riscv64] MI2a: marked for install (shallow): alsa-topology-conf
[riscv64] MI2a: satisfying Depends: libfreetype.so.6()(64bit) >= set:lgbRoQAZgZrIYtjTu3b9hvg7Ddskm4SAR7NYlLLD6a7h37c2Si1
[riscv64] MI2a: maybe install (a providing target): libfreetype 2.14.3-alt1:sisyphus_riscv64+116242.100.1.1 at 1774475273
[riscv64] MI2a: target SELECTED: libfreetype 2.14.3-alt1:sisyphus_riscv64+116242.100.1.1 at 1774475273
[riscv64] MI2a: requesting to install libfreetype (unspec'd ver; inspect with Debug::pkgMark-shallow)
[riscv64] MI2a: marked for install (shallow): libfreetype
[riscv64] MI2a: satisfying PreDepends: libharfbuzz (NULL)
[riscv64] MI2a: maybe install (a direct target): libharfbuzz 14.2.1-alt1:sisyphus_riscv64+127679.100.1.1 at 1780476482
[riscv64] MI2a: target SELECTED: libharfbuzz 14.2.1-alt1:sisyphus_riscv64+127679.100.1.1 at 1780476482
[riscv64] MI2a: requesting to install libharfbuzz (unspec'd ver; inspect with Debug::pkgMark-shallow)
[riscv64] MI2a: marked for install (shallow): libharfbuzz
[riscv64] MI2a: satisfying Depends: libgraphite2.so.3()(64bit) >= set:kf32hGmUjq3tuKutzOJRzIQSHEyjposq2iEoszFE7SlOdnc
[riscv64] MI2a: maybe install (a providing target): libgraphite2 1.3.15-alt1:sisyphus_riscv64+127436.200.1.1 at 1780337476
[riscv64] MI2a: target SELECTED: libgraphite2 1.3.15-alt1:sisyphus_riscv64+127436.200.1.1 at 1780337476
[riscv64] MI2a: requesting to install libgraphite2 (unspec'd ver; inspect with Debug::pkgMark-shallow)
[riscv64] MI2a: marked for install (shallow): libgraphite2
[riscv64] MI2a: satisfying Depends: libbrotlidec.so.1()(64bit) >= set:hgSP7
[riscv64] MI2a: maybe install (a providing target): libbrotlidec 1.2.0-alt1:sisyphus_riscv64+98962.100.1.1 at 1761678642
[riscv64] MI2a: target SELECTED: libbrotlidec 1.2.0-alt1:sisyphus_riscv64+98962.100.1.1 at 1761678642
[riscv64] MI2a: requesting to install libbrotlidec (unspec'd ver; inspect with Debug::pkgMark-shallow)
[riscv64] MI2a: marked for install (shallow): libbrotlidec
[riscv64] MI2a: satisfying Depends: libbrotlicommon = 1.2.0-alt1:sisyphus_riscv64+98962.100.1.1
[riscv64] MI2a: maybe install (a direct target): libbrotlicommon 1.2.0-alt1:sisyphus_riscv64+98962.100.1.1 at 1761678642
[riscv64] MI2a: target SELECTED: libbrotlicommon 1.2.0-alt1:sisyphus_riscv64+98962.100.1.1 at 1761678642
[riscv64] MI2a: requesting to install libbrotlicommon (unspec'd ver; inspect with Debug::pkgMark-shallow)
[riscv64] MI2a: marked for install (shallow): libbrotlicommon
[riscv64] MI2a: satisfying Depends: libjpeg.so.62()(64bit) >= set:kfjKR4ozTrhOxIegYw6up5cWM4wQbvOOzgAHdTr7Kx7dA3oCxyhjJD1XNAaZj9tdtv1
[riscv64] MI2a: maybe install (a providing target): libjpeg 2:3.1.4.1-alt1:sisyphus_riscv64+117065.100.1.1 at 1774912965
[riscv64] MI2a: target SELECTED: libjpeg 2:3.1.4.1-alt1:sisyphus_riscv64+117065.100.1.1 at 1774912965
[riscv64] MI2a: requesting to install libjpeg (unspec'd ver; inspect with Debug::pkgMark-shallow)
[riscv64] MI2a: marked for install (shallow): libjpeg
[riscv64] MI2a: satisfying Depends: liblcms2.so.2()(64bit) >= set:mgZvFZxIxB750wh7VnyKCaHNtYgQQca6wKNtRetYR4z55IGGzLjvXS9niBDKEHTVjZhMgUkTVJZGDwisO1mFcZrA29MtMFB3
[riscv64] MI2a: maybe install (a providing target): liblcms2 2.19.1-alt1:sisyphus_riscv64+124329.100.1.1 at 1778594979
[riscv64] MI2a: target SELECTED: liblcms2 2.19.1-alt1:sisyphus_riscv64+124329.100.1.1 at 1778594979
[riscv64] MI2a: requesting to install liblcms2 (unspec'd ver; inspect with Debug::pkgMark-shallow)
[riscv64] MI2a: marked for install (shallow): liblcms2
[riscv64] MI2a: satisfying Depends: java-stub-javadoc (NULL)
[riscv64] MI2a: maybe install (a direct target): java-stub-javadoc 0.1-alt1:sisyphus_riscv64+16018.200.1.1 at 1643193745
[riscv64] MI2a: target SELECTED: java-stub-javadoc 0.1-alt1:sisyphus_riscv64+16018.200.1.1 at 1643193745
[riscv64] MI2a: requesting to install java-stub-javadoc (unspec'd ver; inspect with Debug::pkgMark-shallow)
[riscv64] MI2a: marked for install (shallow): java-stub-javadoc
[riscv64] MI2a: marked for install (shallow): moditect-maven-plugin
[riscv64] MI2a: satisfying Depends: moditect-core = 1.3.0-alt1:sisyphus_riscv64+100380.200.1.1
[riscv64] MI2a: maybe install (a direct target): moditect-core 1.3.0-alt1:sisyphus_riscv64+100380.200.1.1 at 1762955163
[riscv64] MI2a: target SELECTED: moditect-core 1.3.0-alt1:sisyphus_riscv64+100380.200.1.1 at 1762955163
[riscv64] MI2a: requesting to install moditect-core (unspec'd ver; inspect with Debug::pkgMark-shallow)
[riscv64] MI2a: marked for install (shallow): moditect-core
[riscv64] MI2a: satisfying Depends: mvn(com.github.javaparser:javaparser-core) (NULL)
[riscv64] MI2a: maybe install (a providing target): javaparser 3.26.2-alt2:sisyphus_riscv64+106739.100.1.1 at 1768401748
[riscv64] MI2a: target SELECTED: javaparser 3.26.2-alt2:sisyphus_riscv64+106739.100.1.1 at 1768401748
[riscv64] MI2a: requesting to install javaparser (unspec'd ver; inspect with Debug::pkgMark-shallow)
[riscv64] MI2a: marked for install (shallow): javaparser
[riscv64] MI2a: satisfying Depends: mvn(org.checkerframework:checker-qual) (NULL)
[riscv64] MI2a: maybe install (a providing target): checker-qual 3.52.0-alt1:sisyphus_riscv64+101180.100.1.1 at 1763580904
[riscv64] MI2a: target SELECTED: checker-qual 3.52.0-alt1:sisyphus_riscv64+101180.100.1.1 at 1763580904
[riscv64] MI2a: requesting to install checker-qual (unspec'd ver; inspect with Debug::pkgMark-shallow)
[riscv64] MI2a: marked for install (shallow): checker-qual
[riscv64] MI2a: satisfying Depends: mvn(org.javassist:javassist) (NULL)
[riscv64] MI2a: maybe install (a providing target): javassist 0:3.30.2-alt1:sisyphus_riscv64+105095.100.1.1 at 1766571355
[riscv64] MI2a: target SELECTED: javassist 0:3.30.2-alt1:sisyphus_riscv64+105095.100.1.1 at 1766571355
[riscv64] MI2a: requesting to install javassist (unspec'd ver; inspect with Debug::pkgMark-shallow)
[riscv64] MI2a: marked for install (shallow): javassist
[riscv64] maven-local is already the newest version.
[riscv64] Selecting maven-failsafe-plugin for 'mvn(org.apache.maven.plugins:maven-failsafe-plugin)'
[riscv64] Selecting moditect-maven-plugin for 'mvn(org.moditect:moditect-maven-plugin)'
[riscv64] Selecting maven-compiler-plugin for 'mvn(org.apache.maven.plugins:maven-compiler-plugin)'
[riscv64] maven-compiler-plugin is already the newest version.
[riscv64] E: Couldn't find package mvn(com.google.errorprone:error_prone_core)
[riscv64] hsh-install: Failed to calculate package file list.
[riscv64] hsh-install: Failed to generate package file list.
2026-Jun-27 23:40:55 :: [riscv64] google-gson-2.14.0-alt1.src.rpm: remote: cannot build src.rpm
2026-Jun-27 23:40:55 :: [riscv64] #100 google-gson-2.14.0-alt1.src.rpm: build FAILED
2026-Jun-27 23:40:55 :: [riscv64] requesting cancellation of task processing
2026-Jun-27 23:40:55 :: [riscv64] build FAILED
2026-Jun-27 23:40:55 :: task #130542 for sisyphus_riscv64 FAILED
More information about the Riscv-reports
mailing list