[riscv-reports] [#130470] sisyphus_riscv64 FAILED srpm=llama.cpp-9804-alt1.src.rpm
Girar sisyphus_riscv64 awaiter recycler
noreply at basealt.ru
Sat Jun 27 20:22:24 MSK 2026
http://web.build.srt.basealt.ru/tasks/130470/logs/events.1.1.log
subtask name riscv64
#100 llama.cpp failed
2026-Jun-27 16:32:37 :: shared task #130470 for sisyphus_riscv64 started by recycler:
2026-Jun-27 16:32:37 :: message: sync
#100 build llama.cpp-9804-alt1.src.rpm
2026-Jun-27 16:32:43 :: [riscv64] #100 llama.cpp-9804-alt1.src.rpm: build start
[riscv64] /usr/bin/cmake -E cmake_progress_start /usr/src/RPM/BUILD/llama.cpp-9804/riscv64-alt-linux/CMakeFiles 0
[riscv64] gmake: Leaving directory '/usr/src/RPM/BUILD/llama.cpp-9804/riscv64-alt-linux'
[riscv64] + find -name '*.py'
[riscv64] + xargs sed -i '1s|#!/usr/bin/env python3|#!/usr/bin/python3|'
[riscv64] + LD_LIBRARY_PATH=riscv64-alt-linux/bin
[riscv64] + riscv64-alt-linux/bin/llama-server --completion-bash
[riscv64] /usr/src/tmp/rpmb-tmp.4XFopK: line 160: 1278335 Illegal instruction LD_LIBRARY_PATH=riscv64-alt-linux/bin riscv64-alt-linux/bin/llama-server --completion-bash > llama.bash
[riscv64] error: Bad exit status from /usr/src/tmp/rpmb-tmp.4XFopK (%build)
[riscv64] RPM build errors:
[riscv64] Bad exit status from /usr/src/tmp/rpmb-tmp.4XFopK (%build)
2026-Jun-27 17:22:23 :: [riscv64] llama.cpp-9804-alt1.src.rpm: remote: build failed
2026-Jun-27 17:22:23 :: [riscv64] #100 llama.cpp-9804-alt1.src.rpm: build FAILED
2026-Jun-27 17:22:23 :: [riscv64] requesting cancellation of task processing
2026-Jun-27 17:22:24 :: [riscv64] build FAILED
2026-Jun-27 17:22:24 :: task #130470 for sisyphus_riscv64 FAILED
More information about the Riscv-reports
mailing list