[riscv-reports] [#130159] sisyphus_riscv64 FAILED srpm=opensearch-3.6.0-alt2.src.rpm
Girar sisyphus_riscv64 awaiter recycler
noreply at basealt.ru
Sat Jun 27 03:24:54 MSK 2026
http://web.build.srt.basealt.ru/tasks/130159/logs/events.1.1.log
2026-Jun-27 00:22:36 :: shared task #130159 for sisyphus_riscv64 started by recycler:
2026-Jun-27 00:22:36 :: message: sync
#100 build opensearch-3.6.0-alt2.src.rpm
2026-Jun-27 00:22:42 :: [riscv64] #100 opensearch-3.6.0-alt2.src.rpm: build start
2026-Jun-27 00:24:51 :: [riscv64] #100 opensearch-3.6.0-alt2.src.rpm: build SKIPPED
2026-Jun-27 00:24:54 :: #100: opensearch-3.6.0-alt2.src.rpm: no source package
2026-Jun-27 00:24:54 :: build check FAILED for: #100
2026-Jun-27 00:24:54 :: task #130159 for sisyphus_riscv64 FAILED
More information about the Riscv-reports
mailing list