[riscv-reports] [#130112] sisyphus_riscv64 FAILED srpm=shader-slang-2026.11-alt1.src.rpm srpm=vlither-2.5-alt1.src.rpm
Girar sisyphus_riscv64 awaiter recycler
noreply at basealt.ru
Fri Jun 26 23:53:59 MSK 2026
http://web.build.srt.basealt.ru/tasks/130112/logs/events.1.1.log
subtask name riscv64
#100 shader-slang failed
2026-Jun-26 20:48:42 :: shared task #130112 for sisyphus_riscv64 started by recycler:
2026-Jun-26 20:48:42 :: message: sync
#100 build shader-slang-2026.11-alt1.src.rpm
#200 build vlither-2.5-alt1.src.rpm
2026-Jun-26 20:48:43 :: created build repo
2026-Jun-26 20:48:48 :: [riscv64] #100 shader-slang-2026.11-alt1.src.rpm: build start
[riscv64] from /usr/src/RPM/BUILD/shader-slang-2026.11/source/core/slang-riff-file-system.cpp:1:
[riscv64] /usr/src/RPM/BUILD/shader-slang-2026.11/include/slang.h:513:6: error: #error "Couldn't determine endianness"
[riscv64] 513 | #error "Couldn't determine endianness"
[riscv64] --
[riscv64] from /usr/src/RPM/BUILD/shader-slang-2026.11/source/core/slang-render-api-util.cpp:2:
[riscv64] /usr/src/RPM/BUILD/shader-slang-2026.11/include/slang.h:513:6: error: #error "Couldn't determine endianness"
[riscv64] 513 | #error "Couldn't determine endianness"
[riscv64] --
[riscv64] from /usr/src/RPM/BUILD/shader-slang-2026.11/source/core/unix/slang-unix-process.cpp:2:
[riscv64] /usr/src/RPM/BUILD/shader-slang-2026.11/include/slang.h:513:6: error: #error "Couldn't determine endianness"
[riscv64] 513 | #error "Couldn't determine endianness"
[riscv64] --
[riscv64] from /usr/src/RPM/BUILD/shader-slang-2026.11/source/core/slang-persistent-cache.cpp:1:
[riscv64] /usr/src/RPM/BUILD/shader-slang-2026.11/include/slang.h:513:6: error: #error "Couldn't determine endianness"
[riscv64] 513 | #error "Couldn't determine endianness"
[riscv64] --
[riscv64] from /usr/src/RPM/BUILD/shader-slang-2026.11/source/core/slang-file-system.cpp:1:
[riscv64] /usr/src/RPM/BUILD/shader-slang-2026.11/include/slang.h:513:6: error: #error "Couldn't determine endianness"
[riscv64] 513 | #error "Couldn't determine endianness"
[riscv64] --
[riscv64] from /usr/src/RPM/BUILD/shader-slang-2026.11/source/core/slang-http.cpp:1:
[riscv64] /usr/src/RPM/BUILD/shader-slang-2026.11/include/slang.h:513:6: error: #error "Couldn't determine endianness"
[riscv64] 513 | #error "Couldn't determine endianness"
[riscv64] --
[riscv64] from /usr/src/RPM/BUILD/shader-slang-2026.11/source/core/slang-command-options.cpp:3:
[riscv64] /usr/src/RPM/BUILD/shader-slang-2026.11/include/slang.h:513:6: error: #error "Couldn't determine endianness"
[riscv64] 513 | #error "Couldn't determine endianness"
[riscv64] --
[riscv64] from /usr/src/RPM/BUILD/shader-slang-2026.11/source/core/slang-string-slice-pool.cpp:1:
[riscv64] /usr/src/RPM/BUILD/shader-slang-2026.11/include/slang.h:513:6: error: #error "Couldn't determine endianness"
[riscv64] 513 | #error "Couldn't determine endianness"
[riscv64] --
[riscv64] from /usr/src/RPM/BUILD/shader-slang-2026.11/source/core/slang-archive-file-system.cpp:1:
[riscv64] /usr/src/RPM/BUILD/shader-slang-2026.11/include/slang.h:513:6: error: #error "Couldn't determine endianness"
[riscv64] 513 | #error "Couldn't determine endianness"
[riscv64] --
[riscv64] from /usr/src/RPM/BUILD/shader-slang-2026.11/source/core/slang-rtti-info.cpp:1:
[riscv64] /usr/src/RPM/BUILD/shader-slang-2026.11/include/slang.h:513:6: error: #error "Couldn't determine endianness"
[riscv64] 513 | #error "Couldn't determine endianness"
2026-Jun-26 20:53:58 :: [riscv64] shader-slang-2026.11-alt1.src.rpm: remote: build failed
2026-Jun-26 20:53:58 :: [riscv64] #100 shader-slang-2026.11-alt1.src.rpm: build FAILED
2026-Jun-26 20:53:58 :: [riscv64] requesting cancellation of task processing
2026-Jun-26 20:53:59 :: [riscv64] build FAILED
2026-Jun-26 20:53:59 :: task #130112 for sisyphus_riscv64 FAILED
More information about the Riscv-reports
mailing list