[riscv-reports] [#130172] [test-only] sisyphus_riscv64 FAILED srpm=gdb-17.2.0.32.4f981313519-alt1.src.rpm
Girar sisyphus_riscv64 awaiter iv
noreply at basealt.ru
Thu Jun 25 19:08:21 MSK 2026
http://web.build.srt.basealt.ru/tasks/130172/logs/events.1.1.log
subtask name riscv64
#100 gdb failed
2026-Jun-25 15:20:28 :: test-only shared task #130172 for sisyphus_riscv64 started by iv:
#100 build gdb-17.2.0.32.4f981313519-alt1.src.rpm
2026-Jun-25 15:20:37 :: [riscv64] #100 gdb-17.2.0.32.4f981313519-alt1.src.rpm: build start
[riscv64] Processing files: gdbserver-17.2.0.32.4f981313519-alt1
[riscv64] error: No such file or directory: /usr/src/tmp/gdb-buildroot/usr/lib64/libinproctrace.so
[riscv64] RPM build errors:
[riscv64] No such file or directory: /usr/src/tmp/gdb-buildroot/usr/lib64/libinproctrace.so
2026-Jun-25 16:08:20 :: [riscv64] gdb-17.2.0.32.4f981313519-alt1.src.rpm: remote: build failed
2026-Jun-25 16:08:20 :: [riscv64] #100 gdb-17.2.0.32.4f981313519-alt1.src.rpm: build FAILED
2026-Jun-25 16:08:20 :: [riscv64] requesting cancellation of task processing
2026-Jun-25 16:08:21 :: [riscv64] build FAILED
2026-Jun-25 16:08:21 :: task #130172 for sisyphus_riscv64 FAILED
More information about the Riscv-reports
mailing list