[riscv-reports] [#130077] sisyphus_riscv64 FAILED srpm=whisper-cpp-1.9.1-alt1.src.rpm
Girar sisyphus_riscv64 awaiter recycler
noreply at basealt.ru
Thu Jun 25 11:53:08 MSK 2026
http://web.build.srt.basealt.ru/tasks/130077/logs/events.1.1.log
subtask name riscv64
#100 whisper-cpp failed
2026-Jun-25 08:30:37 :: shared task #130077 for sisyphus_riscv64 started by recycler:
2026-Jun-25 08:30:37 :: message: sync
#100 build whisper-cpp-1.9.1-alt1.src.rpm
2026-Jun-25 08:30:42 :: [riscv64] #100 whisper-cpp-1.9.1-alt1.src.rpm: build start
[riscv64] ggml_backend_load_best: search path /usr/lib64/whisper-cpp does not exist
[riscv64] 8% tests passed, 12 tests failed out of 13
[riscv64] Label Time Summary:
[riscv64] --
[riscv64] Total Test time (real) = 0.13 sec
[riscv64] The following tests FAILED:
[riscv64] 1 - test-whisper-cli-tiny (ILLEGAL) gh tiny
2026-Jun-25 08:53:07 :: [riscv64] whisper-cpp-1.9.1-alt1.src.rpm: remote: build failed
2026-Jun-25 08:53:07 :: [riscv64] #100 whisper-cpp-1.9.1-alt1.src.rpm: build FAILED
2026-Jun-25 08:53:07 :: [riscv64] requesting cancellation of task processing
2026-Jun-25 08:53:08 :: [riscv64] build FAILED
2026-Jun-25 08:53:08 :: task #130077 for sisyphus_riscv64 FAILED
More information about the Riscv-reports
mailing list