[riscv-reports] [#130059] sisyphus_riscv64 FAILED srpm=glog-0.7.1-alt3.src.rpm

Girar sisyphus_riscv64 awaiter recycler noreply at basealt.ru
Thu Jun 25 10:13:20 MSK 2026


http://web.build.srt.basealt.ru/tasks/130059/logs/events.1.1.log

subtask  name  riscv64
   #100  glog   failed

2026-Jun-25 07:08:04 :: shared task #130059 for sisyphus_riscv64 started by recycler:
2026-Jun-25 07:08:04 :: message: sync
#100 build glog-0.7.1-alt3.src.rpm
2026-Jun-25 07:08:10 :: [riscv64] #100 glog-0.7.1-alt3.src.rpm: build start
[riscv64] 26/26 Test #26: dcheck_off .......................***Not Run (Disabled)   0.00 sec
[riscv64] 91% tests passed, 2 tests failed out of 23
[riscv64] Total Test time (real) =  39.28 sec
[riscv64] --
[riscv64] 	 26 - dcheck_off (Disabled)
[riscv64] The following tests FAILED:
[riscv64] 	  4 - stacktrace (Subprocess aborted)
2026-Jun-25 07:13:19 :: [riscv64] glog-0.7.1-alt3.src.rpm: remote: build failed
2026-Jun-25 07:13:19 :: [riscv64] #100 glog-0.7.1-alt3.src.rpm: build FAILED
2026-Jun-25 07:13:19 :: [riscv64] requesting cancellation of task processing
2026-Jun-25 07:13:20 :: [riscv64] build FAILED
2026-Jun-25 07:13:20 :: task #130059 for sisyphus_riscv64 FAILED


More information about the Riscv-reports mailing list