[riscv-reports] [#130199] [test-only] sisyphus_riscv64 FAILED srpm=llama.cpp-9758-alt1.src.rpm
Girar sisyphus_riscv64 awaiter k0tran
noreply at basealt.ru
Wed Jun 24 16:39:09 MSK 2026
http://web.build.srt.basealt.ru/tasks/130199/logs/events.1.1.log
subtask name riscv64
#100 llama.cpp failed
2026-Jun-24 13:19:23 :: test-only task #130199 for sisyphus_riscv64 started by k0tran:
2026-Jun-24 13:19:23 :: message: now_builds
#100 build llama.cpp-9758-alt1.src.rpm
2026-Jun-24 13:19:29 :: [riscv64] #100 llama.cpp-9758-alt1.src.rpm: build start
[riscv64] /usr/bin/cmake -E cmake_progress_start /usr/src/RPM/BUILD/llama.cpp-9758/riscv64-alt-linux/CMakeFiles 0
[riscv64] gmake: Leaving directory '/usr/src/RPM/BUILD/llama.cpp-9758/riscv64-alt-linux'
[riscv64] + find -name '*.py'
[riscv64] + xargs sed -i '1s|#!/usr/bin/env python3|#!/usr/bin/python3|'
[riscv64] + LD_LIBRARY_PATH=riscv64-alt-linux/bin
[riscv64] + riscv64-alt-linux/bin/llama-server --completion-bash
[riscv64] /usr/src/tmp/rpmb-tmp.5zhovu: line 160: 513708 Illegal instruction LD_LIBRARY_PATH=riscv64-alt-linux/bin riscv64-alt-linux/bin/llama-server --completion-bash > llama.bash
[riscv64] error: Bad exit status from /usr/src/tmp/rpmb-tmp.5zhovu (%build)
[riscv64] RPM build errors:
[riscv64] Bad exit status from /usr/src/tmp/rpmb-tmp.5zhovu (%build)
2026-Jun-24 13:39:09 :: [riscv64] llama.cpp-9758-alt1.src.rpm: remote: build failed
2026-Jun-24 13:39:09 :: [riscv64] #100 llama.cpp-9758-alt1.src.rpm: build FAILED
2026-Jun-24 13:39:09 :: [riscv64] requesting cancellation of task processing
2026-Jun-24 13:39:09 :: [riscv64] build FAILED
2026-Jun-24 13:39:09 :: task #130199 for sisyphus_riscv64 FAILED
More information about the Riscv-reports
mailing list