[riscv-reports] [#129854] sisyphus_riscv64 FAILED srpm=elmerfem-26.2.1-alt1.src.rpm

Girar sisyphus_riscv64 awaiter recycler noreply at basealt.ru
Wed Jun 24 08:54:51 MSK 2026


http://web.build.srt.basealt.ru/tasks/129854/logs/events.1.1.log

2026-Jun-24 05:53:25 :: shared task #129854 for sisyphus_riscv64 started by recycler:
2026-Jun-24 05:53:25 :: message: sync
#100 build elmerfem-26.2.1-alt1.src.rpm
2026-Jun-24 05:53:35 :: [riscv64] #100 elmerfem-26.2.1-alt1.src.rpm: build start
2026-Jun-24 05:54:50 :: [riscv64] #100 elmerfem-26.2.1-alt1.src.rpm: build SKIPPED
2026-Jun-24 05:54:50 :: #100: elmerfem-26.2.1-alt1.src.rpm: no source package
2026-Jun-24 05:54:50 :: build check FAILED for: #100 
2026-Jun-24 05:54:50 :: task #129854 for sisyphus_riscv64 FAILED


More information about the Riscv-reports mailing list