[riscv-reports] [#129838] sisyphus_riscv64 FAILED srpm=gn-0.2384.1740f5c2-alt1.src.rpm srpm=electron-42.4.0-alt1.src.rpm

Girar sisyphus_riscv64 awaiter recycler noreply at basealt.ru
Wed Jun 24 06:52:54 MSK 2026


http://web.build.srt.basealt.ru/tasks/129838/logs/events.1.1.log

subtask  name  riscv64
   #100  gn       7:06

2026-Jun-24 03:41:15 :: shared task #129838 for sisyphus_riscv64 started by recycler:
2026-Jun-24 03:41:15 :: message: sync
#100 build gn-0.2384.1740f5c2-alt1.src.rpm
#200 build electron-42.4.0-alt1.src.rpm
2026-Jun-24 03:41:15 :: created build repo
2026-Jun-24 03:41:20 :: [riscv64] #100 gn-0.2384.1740f5c2-alt1.src.rpm: build start
2026-Jun-24 03:48:26 :: [riscv64] #100 gn-0.2384.1740f5c2-alt1.src.rpm: build OK
2026-Jun-24 03:48:26 :: [riscv64] #200 electron-42.4.0-alt1.src.rpm: build start
2026-Jun-24 03:52:41 :: [riscv64] #200 electron-42.4.0-alt1.src.rpm: build SKIPPED
2026-Jun-24 03:52:42 :: 100: build check OK
2026-Jun-24 03:52:54 :: #200: electron-42.4.0-alt1.src.rpm: no source package
2026-Jun-24 03:52:54 :: build check FAILED for: #200 
2026-Jun-24 03:52:54 :: task #129838 for sisyphus_riscv64 FAILED


More information about the Riscv-reports mailing list