[riscv-reports] [#129705] sisyphus_riscv64 FAILED srpm=libllhttp-9.4.2-alt1.src.rpm

Girar sisyphus_riscv64 awaiter recycler noreply at basealt.ru
Tue Jun 23 22:10:52 MSK 2026


http://web.build.srt.basealt.ru/tasks/129705/logs/events.1.1.log

subtask  name       riscv64
   #100  libllhttp     2:20

2026-Jun-23 19:07:18 :: shared task #129705 for sisyphus_riscv64 started by recycler:
2026-Jun-23 19:07:18 :: message: sync
#100 build libllhttp-9.4.2-alt1.src.rpm
2026-Jun-23 19:07:27 :: [riscv64] #100 libllhttp-9.4.2-alt1.src.rpm: build start
2026-Jun-23 19:09:47 :: [riscv64] #100 libllhttp-9.4.2-alt1.src.rpm: build OK
2026-Jun-23 19:09:48 :: 100: build check OK
2026-Jun-23 19:09:48 :: build check OK
2026-Jun-23 19:09:48 :: #100: libllhttp-9.4.2-alt1.src.rpm: version check OK
2026-Jun-23 19:09:49 :: build version check OK
2026-Jun-23 19:09:49 :: noarch check OK
2026-Jun-23 19:09:49 :: plan: src +1 -1 =21122, riscv64 +3 -3 =37380
#100 libllhttp 9.3.1-alt1 -> 9.4.2-alt1
 Fri Jun 19 2026 Stanislav Levin <slev at altlinux.org> 9.4.2-alt1
 - 9.4.1 -> 9.4.2.
 Tue May 12 2026 Stanislav Levin <slev at altlinux.org> 9.4.1-alt1
 - 9.3.1 -> 9.4.1.
2026-Jun-23 19:10:14 :: patched apt indices
2026-Jun-23 19:10:17 :: created next repo
2026-Jun-23 19:10:27 :: duplicate provides check OK
	riscv64: NEW unmet dependencies detected:
 python3-module-aiohttp#3.13.5-alt1:sisyphus_riscv64+117556.100.1.1 at 1775152241             libllhttp.so.9.3()(64bit) >= set:kgvrwoAugAMUKZCxnRSfFd8lKpmK2hxe
 python3-module-aiohttp-debuginfo#3.13.5-alt1:sisyphus_riscv64+117556.100.1.1 at 1775152241   debug64(libllhttp.so.9.3)
 python3-module-httptools#0.8.0-alt1:sisyphus_riscv64+128142.100.1.1 at 1780768554            libllhttp.so.9.3()(64bit) >= set:kfvrUj1cVP3yn2rEwpkDrsZBTqnVntjCh76ok8iLdPWa45W0
 python3-module-httptools-debuginfo#0.8.0-alt1:sisyphus_riscv64+128142.100.1.1 at 1780768554  debug64(libllhttp.so.9.3)
	ACLs of affected packages (2):
 python3-module-aiohttp
 python3-module-httptools
2026-Jun-23 19:10:52 :: unmets: riscv64 +4 -0 =4
2026-Jun-23 19:10:52 :: dependencies check FAILED
2026-Jun-23 19:10:52 :: task #129705 for sisyphus_riscv64 FAILED


More information about the Riscv-reports mailing list