[riscv-reports] [#133553] sisyphus_riscv64 FAILED srpm=sqlit-tui-1.5.2-alt1.src.rpm

Girar sisyphus_riscv64 awaiter recycler noreply at basealt.ru
Fri Jul 31 05:14:55 MSK 2026


http://web.build.srt.basealt.ru/tasks/133553/logs/events.1.1.log

subtask  name       riscv64
   #100  sqlit-tui   failed

2026-Jul-31 02:03:33 :: shared task #133553 for sisyphus_riscv64 started by recycler:
2026-Jul-31 02:03:33 :: message: sync
#100 build sqlit-tui-1.5.2-alt1.src.rpm
2026-Jul-31 02:03:39 :: [riscv64] #100 sqlit-tui-1.5.2-alt1.src.rpm: build start
[riscv64] =========================== short test summary info ============================
[riscv64] FAILED tests/ui/keybindings/test_visual_mode.py::TestVisualModeOperators::test_visual_yank - textual.css.query.NoMatches: No nodes match '#query-input' on Screen(id='_default')
[riscv64] FAILED tests/ui/keybindings/test_visual_mode.py::TestVisualModeOperators::test_visual_line_yank - textual.css.query.NoMatches: No nodes match '#query-input' on Screen(id='_default')
[riscv64] ==== 2 failed, 1639 passed, 707 skipped, 1 deselected in 438.43s (0:07:18) =====
[riscv64] INFO     : Command's result: FAILURE
[riscv64] INFO     : Command's error: Command '['python3', '-m', 'pytest', '-v', '-k', 'not test_pending_query_set_before_connecting']' returned non-zero exit status 1.
[riscv64] error: Bad exit status from /usr/src/tmp/rpmb-tmp.EWfiTn (%check)
2026-Jul-31 02:14:54 :: [riscv64] sqlit-tui-1.5.2-alt1.src.rpm: remote: build failed
2026-Jul-31 02:14:54 :: [riscv64] #100 sqlit-tui-1.5.2-alt1.src.rpm: build FAILED
2026-Jul-31 02:14:54 :: [riscv64] requesting cancellation of task processing
2026-Jul-31 02:14:55 :: [riscv64] build FAILED
2026-Jul-31 02:14:55 :: task #133553 for sisyphus_riscv64 FAILED


More information about the Riscv-reports mailing list