[riscv-reports] [#132666] sisyphus_riscv64 FAILED (try 3) srpm=python3-module-pytest-test-groups-1.2.1-alt1.src.rpm ...
Girar sisyphus_riscv64 awaiter recycler
noreply at basealt.ru
Tue Jul 21 17:36:53 MSK 2026
http://web.build.srt.basealt.ru/tasks/132666/logs/events.3.1.log
subtask name riscv64
#200 python3-module-pytest-codspeed failed
2026-Jul-21 14:31:44 :: shared task #132666 for sisyphus_riscv64 resumed by recycler:
2026-Jul-21 14:31:44 :: message: sync
#100 build python3-module-pytest-test-groups-1.2.1-alt1.src.rpm
#200 build python3-module-pytest-codspeed-5.0.3-alt1.src.rpm
#300 build python3-module-uvicorn-0.51.0-alt1.src.rpm
2026-Jul-21 14:31:44 :: created build repo
2026-Jul-21 14:31:58 :: [riscv64] #100 python3-module-pytest-test-groups-1.2.1-alt1.src.rpm: build start
2026-Jul-21 14:34:00 :: [riscv64] #100 python3-module-pytest-test-groups-1.2.1-alt1.src.rpm: build OK (cached)
2026-Jul-21 14:34:00 :: [riscv64] #200 python3-module-pytest-codspeed-5.0.3-alt1.src.rpm: build start
[riscv64] Processing files: python3-module-pytest-codspeed-5.0.3-alt1
[riscv64] error: No such file or directory: /usr/src/tmp/python3-module-pytest-codspeed-buildroot/usr/lib64/python3/site-packages/pytest_codspeed
[riscv64] error: No such file or directory: /usr/src/tmp/python3-module-pytest-codspeed-buildroot/usr/lib64/python3/site-packages/pytest_codspeed-5.0.3.dist-info
[riscv64] RPM build errors:
[riscv64] No such file or directory: /usr/src/tmp/python3-module-pytest-codspeed-buildroot/usr/lib64/python3/site-packages/pytest_codspeed
[riscv64] No such file or directory: /usr/src/tmp/python3-module-pytest-codspeed-buildroot/usr/lib64/python3/site-packages/pytest_codspeed-5.0.3.dist-info
2026-Jul-21 14:36:53 :: [riscv64] python3-module-pytest-codspeed-5.0.3-alt1.src.rpm: remote: build failed
2026-Jul-21 14:36:53 :: [riscv64] #200 python3-module-pytest-codspeed-5.0.3-alt1.src.rpm: build FAILED
2026-Jul-21 14:36:53 :: [riscv64] requesting cancellation of task processing
2026-Jul-21 14:36:53 :: [riscv64] build FAILED
2026-Jul-21 14:36:53 :: task #132666 for sisyphus_riscv64 FAILED
More information about the Riscv-reports
mailing list