[riscv-reports] [#133346] sisyphus_riscv64 FAILED srpm=osu-lazer-2026.711.0-alt1.src.rpm
Girar sisyphus_riscv64 awaiter recycler
noreply at basealt.ru
Sun Jul 19 23:01:40 MSK 2026
http://web.build.srt.basealt.ru/tasks/133346/logs/events.1.1.log
2026-Jul-19 19:59:14 :: shared task #133346 for sisyphus_riscv64 started by recycler:
2026-Jul-19 19:59:14 :: message: sync
#100 build osu-lazer-2026.711.0-alt1.src.rpm
2026-Jul-19 19:59:20 :: [riscv64] #100 osu-lazer-2026.711.0-alt1.src.rpm: build start
2026-Jul-19 20:01:37 :: [riscv64] #100 osu-lazer-2026.711.0-alt1.src.rpm: build SKIPPED
2026-Jul-19 20:01:39 :: #100: osu-lazer-2026.711.0-alt1.src.rpm: no source package
2026-Jul-19 20:01:39 :: build check FAILED for: #100
2026-Jul-19 20:01:39 :: task #133346 for sisyphus_riscv64 FAILED
More information about the Riscv-reports
mailing list