[riscv-reports] [#133298] sisyphus_riscv64 FAILED srpm=opencommit-3.3.9-alt1.src.rpm
Girar sisyphus_riscv64 awaiter recycler
noreply at basealt.ru
Sun Jul 19 13:40:07 MSK 2026
http://web.build.srt.basealt.ru/tasks/133298/logs/events.1.1.log
subtask name riscv64
#100 opencommit failed
2026-Jul-19 10:36:09 :: shared task #133298 for sisyphus_riscv64 started by recycler:
2026-Jul-19 10:36:09 :: message: sync
#100 build opencommit-3.3.9-alt1.src.rpm
2026-Jul-19 10:36:14 :: [riscv64] #100 opencommit-3.3.9-alt1.src.rpm: build start
[riscv64] PASS test/unit/removeContentTags.test.ts (49.801 s)
[riscv64] ReferenceError: You are trying to `import` a file after the Jest environment has been torn down. From test/unit/anthropic.test.ts.
[riscv64] ReferenceError: You are trying to `import` a file after the Jest environment has been torn down. From test/unit/anthropic.test.ts.
[riscv64] FAIL test/unit/anthropic.test.ts
[riscv64] â Test suite failed to run
[riscv64] RangeError: WebAssembly.Instance(): Out of memory: Cannot allocate Wasm memory for new instance
[riscv64] at Object.<anonymous> (node_modules/@dqbd/tiktoken/lite/tiktoken.cjs:36:22)
[riscv64] ReferenceError: You are trying to `import` a file after the Jest environment has been torn down. From test/unit/openAi.test.ts.
[riscv64] ReferenceError: You are trying to `import` a file after the Jest environment has been torn down. From test/unit/openAi.test.ts.
[riscv64] FAIL test/unit/openAi.test.ts
[riscv64] â Test suite failed to run
[riscv64] RangeError: WebAssembly.Instance(): Out of memory: Cannot allocate Wasm memory for new instance
[riscv64] at Object.<anonymous> (node_modules/@dqbd/tiktoken/lite/tiktoken.cjs:36:22)
[riscv64] ReferenceError: You are trying to `import` a file after the Jest environment has been torn down. From test/unit/proxy.test.ts.
[riscv64] ReferenceError: You are trying to `import` a file after the Jest environment has been torn down. From test/unit/proxy.test.ts.
[riscv64] FAIL test/unit/proxy.test.ts
[riscv64] â Test suite failed to run
[riscv64] RangeError: WebAssembly.Instance(): Out of memory: Cannot allocate Wasm memory for new instance
[riscv64] at Object.<anonymous> (node_modules/@dqbd/tiktoken/lite/tiktoken.cjs:36:22)
[riscv64] ReferenceError: You are trying to `import` a file after the Jest environment has been torn down. From test/unit/proxy.test.ts.
[riscv64] ReferenceError: You are trying to `import` a file after the Jest environment has been torn down. From test/unit/proxy.test.ts.
2026-Jul-19 10:40:06 :: [riscv64] opencommit-3.3.9-alt1.src.rpm: remote: build failed
2026-Jul-19 10:40:06 :: [riscv64] #100 opencommit-3.3.9-alt1.src.rpm: build FAILED
2026-Jul-19 10:40:06 :: [riscv64] requesting cancellation of task processing
2026-Jul-19 10:40:07 :: [riscv64] build FAILED
2026-Jul-19 10:40:07 :: task #133298 for sisyphus_riscv64 FAILED
More information about the Riscv-reports
mailing list