[riscv-reports] [#132072] sisyphus_riscv64 FAILED (try 2) srpm=stellarium-26.2-alt1.src.rpm

Girar sisyphus_riscv64 awaiter recycler noreply at basealt.ru
Fri Jul 17 18:50:10 MSK 2026


http://web.build.srt.basealt.ru/tasks/132072/logs/events.2.1.log

subtask  name        riscv64
   #100  stellarium   failed

2026-Jul-17 15:27:09 :: shared task #132072 for sisyphus_riscv64 resumed by recycler:
2026-Jul-17 15:27:09 :: message: sync
#100 build stellarium-26.2-alt1.src.rpm
2026-Jul-17 15:27:15 :: [riscv64] #100 stellarium-26.2-alt1.src.rpm: build start
[riscv64] + /bin/mkdir -p /usr/src/RPM/BUILD
[riscv64] + cd /usr/src/RPM/BUILD
[riscv64] + cd stellarium-26.2
[riscv64] + export LANG=en_US.UTF-8
[riscv64] + LANG=en_US.UTF-8
[riscv64] + xvfb-run ctest --test-dir riscv64-alt-linux --output-on-failure --force-new-ctest-process --parallel 60 -E testCalendars
[riscv64] /usr/src/tmp/rpmb-tmp.QCe2GK: line 140: xvfb-run: command not found
[riscv64] error: Bad exit status from /usr/src/tmp/rpmb-tmp.QCe2GK (%check)
[riscv64] RPM build errors:
[riscv64]     Bad exit status from /usr/src/tmp/rpmb-tmp.QCe2GK (%check)
2026-Jul-17 15:50:10 :: [riscv64] stellarium-26.2-alt1.src.rpm: remote: build failed
2026-Jul-17 15:50:10 :: [riscv64] #100 stellarium-26.2-alt1.src.rpm: build FAILED
2026-Jul-17 15:50:10 :: [riscv64] requesting cancellation of task processing
2026-Jul-17 15:50:10 :: [riscv64] build FAILED
2026-Jul-17 15:50:10 :: task #132072 for sisyphus_riscv64 FAILED


More information about the Riscv-reports mailing list