[riscv-reports] [#133162] sisyphus_riscv64 FAILED srpm=smallrye-common-2.15.0-alt1.src.rpm
Girar sisyphus_riscv64 awaiter iv
noreply at basealt.ru
Fri Jul 17 17:07:30 MSK 2026
http://web.build.srt.basealt.ru/tasks/133162/logs/events.1.1.log
subtask name riscv64
#100 smallrye-common failed
2026-Jul-17 14:04:18 :: task #133162 for sisyphus_riscv64 started by iv:
2026-Jul-17 14:04:18 :: message: sync
#100 build smallrye-common-2.15.0-alt1.src.rpm
2026-Jul-17 14:04:25 :: [riscv64] #100 smallrye-common-2.15.0-alt1.src.rpm: build start
[riscv64] [INFO] -------------------------------------------------------------
[riscv64] [ERROR] COMPILATION ERROR :
[riscv64] [INFO] -------------------------------------------------------------
2026-Jul-17 14:07:29 :: [riscv64] smallrye-common-2.15.0-alt1.src.rpm: remote: build failed
2026-Jul-17 14:07:29 :: [riscv64] #100 smallrye-common-2.15.0-alt1.src.rpm: build FAILED
2026-Jul-17 14:07:29 :: [riscv64] requesting cancellation of task processing
2026-Jul-17 14:07:30 :: [riscv64] build FAILED
2026-Jul-17 14:07:30 :: task #133162 for sisyphus_riscv64 FAILED
More information about the Riscv-reports
mailing list