[riscv-reports] [#133094] sisyphus_riscv64 FAILED srpm=lychee-0.24.2-alt1.src.rpm
Girar sisyphus_riscv64 awaiter recycler
noreply at basealt.ru
Fri Jul 17 13:57:36 MSK 2026
http://web.build.srt.basealt.ru/tasks/133094/logs/events.1.1.log
subtask name riscv64
#100 lychee failed
2026-Jul-17 10:18:41 :: shared task #133094 for sisyphus_riscv64 started by recycler:
2026-Jul-17 10:18:41 :: message: sync
#100 build lychee-0.24.2-alt1.src.rpm
2026-Jul-17 10:18:47 :: [riscv64] #100 lychee-0.24.2-alt1.src.rpm: build start
[riscv64] extract::html::html5ever::tests::test_include_verbatim
[riscv64] test result: FAILED. 438 passed; 1 failed; 10 ignored; 0 measured; 0 filtered out; finished in 0.70s
[riscv64] error: test failed, to rerun pass `-p lychee-lib --lib`
[riscv64] Running `/usr/src/RPM/BUILD/lychee-0.24.2/target/release/deps/test_utils-5edd1da95d20c7c4`
[riscv64] --
[riscv64] test result: ok. 0 passed; 0 failed; 0 ignored; 0 measured; 0 filtered out; finished in 0.00s
[riscv64] error: 1 target failed:
[riscv64] `-p lychee-lib --lib`
2026-Jul-17 10:57:35 :: [riscv64] lychee-0.24.2-alt1.src.rpm: remote: build failed
2026-Jul-17 10:57:35 :: [riscv64] #100 lychee-0.24.2-alt1.src.rpm: build FAILED
2026-Jul-17 10:57:35 :: [riscv64] requesting cancellation of task processing
2026-Jul-17 10:57:36 :: [riscv64] build FAILED
2026-Jul-17 10:57:36 :: task #133094 for sisyphus_riscv64 FAILED
More information about the Riscv-reports
mailing list