[riscv-reports] [#133083] sisyphus_riscv64 FAILED srpm=steam-1.0.0.87-alt1.src.rpm
Girar sisyphus_riscv64 awaiter recycler
noreply at basealt.ru
Fri Jul 17 12:57:27 MSK 2026
http://web.build.srt.basealt.ru/tasks/133083/logs/events.1.1.log
2026-Jul-17 09:56:01 :: shared task #133083 for sisyphus_riscv64 started by recycler:
2026-Jul-17 09:56:01 :: message: sync
#100 build steam-1.0.0.87-alt1.src.rpm
2026-Jul-17 09:56:11 :: [riscv64] #100 steam-1.0.0.87-alt1.src.rpm: build start
2026-Jul-17 09:57:26 :: [riscv64] #100 steam-1.0.0.87-alt1.src.rpm: build SKIPPED
2026-Jul-17 09:57:26 :: #100: steam-1.0.0.87-alt1.src.rpm: no source package
2026-Jul-17 09:57:27 :: build check FAILED for: #100
2026-Jul-17 09:57:27 :: task #133083 for sisyphus_riscv64 FAILED
More information about the Riscv-reports
mailing list