[riscv-reports] [#132967] [test-only] sisyphus_riscv64 FAILED jnr-ffi.git=2.1.8-alt0.port.1
Girar sisyphus_riscv64 awaiter iv
noreply at basealt.ru
Thu Jul 16 12:51:45 MSK 2026
http://web.build.srt.basealt.ru/tasks/132967/logs/events.1.1.log
subtask name riscv64
#100 jnr-ffi failed
2026-Jul-16 09:47:19 :: test-only task #132967 for sisyphus_riscv64 started by iv:
2026-Jul-16 09:47:19 :: message: fix_and_build
#100 build 2.1.8-alt0.port.1 from /people/iv/packages/jnr-ffi.git fetched at 2026-Jul-16 07:51:13
2026-Jul-16 09:47:21 :: [riscv64] #100 jnr-ffi.git 2.1.8-alt0.port.1: build start
[riscv64] [ERROR] Tests run: 1, Failures: 0, Errors: 1, Skipped: 0, Time elapsed: 0.010 s <<< FAILURE! -- in jnr.ffi.struct.StructureTest
[riscv64] [ERROR] jnr.ffi.struct.StructureTest -- Time elapsed: 0.010 s <<< ERROR!
[riscv64] java.lang.UnsatisfiedLinkError: could not load FFI provider jnr.ffi.provider.jffi.Provider
[riscv64] at jnr.ffi.provider.InvalidProvider$1.loadLibrary(InvalidProvider.java:48)
[riscv64] --
[riscv64] at java.base/java.lang.reflect.Method.invoke(Method.java:569)
[riscv64] Caused by: java.lang.UnsatisfiedLinkError: could not get native definition for type `POINTER`, original error message follows: cannot determine CPU
[riscv64] at com.kenai.jffi.Type$Builtin.lookupTypeInfo(Type.java:253)
[riscv64] --
[riscv64] [ERROR] Tests run: 1, Failures: 0, Errors: 1, Skipped: 0, Time elapsed: 0.010 s <<< FAILURE! -- in jnr.ffi.struct.UTF8StringFieldTest
[riscv64] [ERROR] jnr.ffi.struct.UTF8StringFieldTest -- Time elapsed: 0.010 s <<< ERROR!
[riscv64] java.lang.UnsatisfiedLinkError: could not load FFI provider jnr.ffi.provider.jffi.Provider
[riscv64] at jnr.ffi.provider.InvalidProvider$1.loadLibrary(InvalidProvider.java:48)
[riscv64] --
[riscv64] at java.base/java.lang.reflect.Method.invoke(Method.java:569)
[riscv64] Caused by: java.lang.UnsatisfiedLinkError: could not get native definition for type `POINTER`, original error message follows: cannot determine CPU
[riscv64] at com.kenai.jffi.Type$Builtin.lookupTypeInfo(Type.java:253)
[riscv64] --
[riscv64] [ERROR] Tests run: 1, Failures: 0, Errors: 1, Skipped: 0, Time elapsed: 0.006 s <<< FAILURE! -- in jnr.ffi.struct.UnionTest
[riscv64] [ERROR] jnr.ffi.struct.UnionTest -- Time elapsed: 0.006 s <<< ERROR!
[riscv64] java.lang.UnsatisfiedLinkError: could not load FFI provider jnr.ffi.provider.jffi.Provider
[riscv64] at jnr.ffi.provider.InvalidProvider$1.loadLibrary(InvalidProvider.java:48)
[riscv64] --
[riscv64] at java.base/java.lang.reflect.Method.invoke(Method.java:569)
[riscv64] Caused by: java.lang.UnsatisfiedLinkError: could not get native definition for type `POINTER`, original error message follows: cannot determine CPU
[riscv64] at com.kenai.jffi.Type$Builtin.lookupTypeInfo(Type.java:253)
[riscv64] --
[riscv64] [ERROR] InvocationTest.setUpClass:38 » UnsatisfiedLink could not load FFI provider jnr.ffi.provider.jffi.Provider
[riscv64] [ERROR] LastErrorTest.testLastError:57->assertSavesError:79->assertSavesError:89 » UnsatisfiedLink could not load FFI provider jnr.ffi.provider.jffi.Provider
[riscv64] [ERROR] LibraryLoaderTest.functionMappersCombine:137 » UnsatisfiedLink could not load FFI provider jnr.ffi.provider.jffi.Provider
2026-Jul-16 09:51:44 :: [riscv64] jnr-ffi.git 2.1.8-alt0.port.1: remote: build failed
2026-Jul-16 09:51:44 :: [riscv64] #100 jnr-ffi.git 2.1.8-alt0.port.1: build FAILED
2026-Jul-16 09:51:44 :: [riscv64] requesting cancellation of task processing
2026-Jul-16 09:51:44 :: [riscv64] build FAILED
2026-Jul-16 09:51:45 :: task #132967 for sisyphus_riscv64 FAILED
More information about the Riscv-reports
mailing list