[riscv-reports] [#132961] sisyphus_riscv64 FAILED srpm=inlyne-0.5.2-alt1.src.rpm

Girar sisyphus_riscv64 awaiter iv noreply at basealt.ru
Thu Jul 16 12:06:33 MSK 2026


http://web.build.srt.basealt.ru/tasks/132961/logs/events.1.1.log

subtask  name    riscv64
   #100  inlyne   failed

2026-Jul-16 08:37:07 :: task #132961 for sisyphus_riscv64 started by iv:
2026-Jul-16 08:37:07 :: message: sync
#100 build inlyne-0.5.2-alt1.src.rpm
2026-Jul-16 08:37:15 :: [riscv64] #100 inlyne-0.5.2-alt1.src.rpm: build start
[riscv64] test interpreter::tests::yaml_frontmatter ... ok
[riscv64] test interpreter::tests::header_inherit_align ... FAILED
[riscv64] test interpreter::tests::image_loading_fails_gracefully ... ok
[riscv64] --
[riscv64] stored new snapshot /usr/src/RPM/BUILD/inlyne-0.5.2/src/interpreter/snapshots/inlyne__interpreter__tests__code_in_ordered_list.snap.new
[riscv64] test interpreter::tests::code_in_ordered_list ... FAILED
[riscv64] test interpreter::tests::handles_comma_in_info_str ... ok
[riscv64] --
[riscv64]     interpreter::tests::header_inherit_align
[riscv64] test result: FAILED. 56 passed; 2 failed; 0 ignored; 0 measured; 0 filtered out; finished in 0.34s
[riscv64] error: test failed, to rerun pass `--bin inlyne`
[riscv64] error: 1 target failed:
[riscv64]     `--bin inlyne`
2026-Jul-16 09:06:32 :: [riscv64] inlyne-0.5.2-alt1.src.rpm: remote: build failed
2026-Jul-16 09:06:32 :: [riscv64] #100 inlyne-0.5.2-alt1.src.rpm: build FAILED
2026-Jul-16 09:06:32 :: [riscv64] requesting cancellation of task processing
2026-Jul-16 09:06:33 :: [riscv64] build FAILED
2026-Jul-16 09:06:33 :: task #132961 for sisyphus_riscv64 FAILED


More information about the Riscv-reports mailing list