[riscv-reports] [#132951] sisyphus_riscv64 FAILED srpm=saxpath-1.0-alt5_20jpp11.src.rpm srpm=freemarker-2.3.32-alt1.src.rpm
Girar sisyphus_riscv64 awaiter iv
noreply at basealt.ru
Thu Jul 16 10:04:31 MSK 2026
http://web.build.srt.basealt.ru/tasks/132951/logs/events.1.1.log
subtask name riscv64
#100 saxpath 4:40
#200 freemarker failed
2026-Jul-16 06:54:52 :: task #132951 for sisyphus_riscv64 started by iv:
2026-Jul-16 06:54:52 :: message: sync
#100 build saxpath-1.0-alt5_20jpp11.src.rpm
#200 build freemarker-2.3.32-alt1.src.rpm
2026-Jul-16 06:54:52 :: created build repo
2026-Jul-16 06:54:57 :: [riscv64] #100 saxpath-1.0-alt5_20jpp11.src.rpm: build start
2026-Jul-16 06:59:37 :: [riscv64] #100 saxpath-1.0-alt5_20jpp11.src.rpm: build OK
2026-Jul-16 06:59:37 :: [riscv64] #200 freemarker-2.3.32-alt1.src.rpm: build start
[riscv64] [ivy:cachepath] ]
[riscv64] BUILD FAILED
[riscv64] /usr/src/RPM/BUILD/freemarker-2.3.32/build.xml:138: syntax errors in ivy file: java.text.ParseException: [[Fatal Error] ivy.xml:20:13: DOCTYPE is disallowed when the feature "http://apache.org/xml/features/disallow-doctype-decl" set to true. in file:/usr/src/RPM/BUILD/freemarker-2.3.32/ivy.xml
[riscv64] at org.apache.ivy.plugins.parser.AbstractModuleDescriptorParser$AbstractParser.checkErrors(AbstractModuleDescriptorParser.java:90)
2026-Jul-16 07:04:30 :: [riscv64] freemarker-2.3.32-alt1.src.rpm: remote: build failed
2026-Jul-16 07:04:30 :: [riscv64] #200 freemarker-2.3.32-alt1.src.rpm: build FAILED
2026-Jul-16 07:04:30 :: [riscv64] requesting cancellation of task processing
2026-Jul-16 07:04:31 :: [riscv64] build FAILED
2026-Jul-16 07:04:31 :: task #132951 for sisyphus_riscv64 FAILED
More information about the Riscv-reports
mailing list