[riscv-reports] [#132913] sisyphus_riscv64 FAILED srpm=fcl-0.7.0-alt2.git1257b41.src.rpm

Girar sisyphus_riscv64 awaiter iv noreply at basealt.ru
Wed Jul 15 18:59:37 MSK 2026


http://web.build.srt.basealt.ru/tasks/132913/logs/events.1.1.log

subtask  name  riscv64
   #100  fcl    failed

2026-Jul-15 15:50:04 :: task #132913 for sisyphus_riscv64 started by iv:
2026-Jul-15 15:50:04 :: message: sync
#100 build fcl-0.7.0-alt2.git1257b41.src.rpm
2026-Jul-15 15:50:12 :: [riscv64] #100 fcl-0.7.0-alt2.git1257b41.src.rpm: build start
[riscv64]     Which is: { 0x2ae7c7dfe0, 0x2ae7c7df60, 0x2ae7c7de60 }
[riscv64] [  FAILED  ] FCL_GJK_EPA.ComputeVisiblePatchColinearNewVertex (0 ms)
[riscv64] [----------] 1 test from FCL_GJK_EPA (0 ms total)
[riscv64] --
[riscv64] [  PASSED  ] 0 tests.
[riscv64] [  FAILED  ] 1 test, listed below:
[riscv64] [  FAILED  ] FCL_GJK_EPA.ComputeVisiblePatchColinearNewVertex
[riscv64]  1 FAILED TEST
[riscv64] 203/261 Test #221: FCL_GJK_EPA.ComputeVisiblePatchSanityCheck ......................................   Passed    0.23 sec
[riscv64] --
[riscv64] 261/261 Test  #23: FCL_BROADPHASE.test_core_mesh_bf_broad_phase_distance_mesh ......................   Passed   74.55 sec
[riscv64] 99% tests passed, 3 tests failed out of 261
[riscv64] Total Test time (real) =  74.73 sec
[riscv64] The following tests FAILED:
[riscv64] 	 41 - CapsuleCapsuleSegmentTest.OverlappingCenterLines<double> (Failed)
2026-Jul-15 15:59:36 :: [riscv64] fcl-0.7.0-alt2.git1257b41.src.rpm: remote: build failed
2026-Jul-15 15:59:36 :: [riscv64] #100 fcl-0.7.0-alt2.git1257b41.src.rpm: build FAILED
2026-Jul-15 15:59:36 :: [riscv64] requesting cancellation of task processing
2026-Jul-15 15:59:37 :: [riscv64] build FAILED
2026-Jul-15 15:59:37 :: task #132913 for sisyphus_riscv64 FAILED


More information about the Riscv-reports mailing list