[riscv-reports] [#132819] sisyphus_riscv64 FAILED srpm=wayvr-26.7.1-alt1.src.rpm
Girar sisyphus_riscv64 awaiter recycler
noreply at basealt.ru
Wed Jul 15 10:31:06 MSK 2026
http://web.build.srt.basealt.ru/tasks/132819/logs/events.1.1.log
2026-Jul-15 07:29:46 :: shared task #132819 for sisyphus_riscv64 started by recycler:
2026-Jul-15 07:29:46 :: message: sync
#100 build wayvr-26.7.1-alt1.src.rpm
2026-Jul-15 07:29:52 :: [riscv64] #100 wayvr-26.7.1-alt1.src.rpm: build start
2026-Jul-15 07:31:05 :: [riscv64] #100 wayvr-26.7.1-alt1.src.rpm: build SKIPPED
2026-Jul-15 07:31:06 :: #100: wayvr-26.7.1-alt1.src.rpm: no source package
2026-Jul-15 07:31:06 :: build check FAILED for: #100
2026-Jul-15 07:31:06 :: task #132819 for sisyphus_riscv64 FAILED
More information about the Riscv-reports
mailing list