[riscv-reports] [#132676] sisyphus_riscv64 FAILED srpm=portprotonqt-1.3.0-alt1.src.rpm

Girar sisyphus_riscv64 awaiter recycler noreply at basealt.ru
Mon Jul 13 23:46:59 MSK 2026


http://web.build.srt.basealt.ru/tasks/132676/logs/events.1.1.log

2026-Jul-13 20:45:37 :: shared task #132676 for sisyphus_riscv64 started by recycler:
2026-Jul-13 20:45:37 :: message: sync
#100 build portprotonqt-1.3.0-alt1.src.rpm
2026-Jul-13 20:45:47 :: [riscv64] #100 portprotonqt-1.3.0-alt1.src.rpm: build start
2026-Jul-13 20:46:59 :: [riscv64] #100 portprotonqt-1.3.0-alt1.src.rpm: build SKIPPED
2026-Jul-13 20:46:59 :: #100: portprotonqt-1.3.0-alt1.src.rpm: no source package
2026-Jul-13 20:46:59 :: build check FAILED for: #100 
2026-Jul-13 20:46:59 :: task #132676 for sisyphus_riscv64 FAILED


More information about the Riscv-reports mailing list