[riscv-reports] [#132606] sisyphus_riscv64 FAILED srpm=qdia-0.65-alt1.src.rpm srpm=kontainer-1.5.0-alt1.src.rpm

Girar sisyphus_riscv64 awaiter recycler noreply at basealt.ru
Mon Jul 13 20:09:22 MSK 2026


http://web.build.srt.basealt.ru/tasks/132606/logs/events.1.1.log

subtask  name       riscv64
   #100  qdia          5:31
   #200  kontainer     5:48

2026-Jul-13 16:43:38 :: shared task #132606 for sisyphus_riscv64 started by recycler:
2026-Jul-13 16:43:38 :: message: sync
#100 build qdia-0.65-alt1.src.rpm
#200 build kontainer-1.5.0-alt1.src.rpm
2026-Jul-13 16:43:38 :: created build repo
2026-Jul-13 16:43:45 :: [riscv64] #100 qdia-0.65-alt1.src.rpm: build start
2026-Jul-13 16:49:16 :: [riscv64] #100 qdia-0.65-alt1.src.rpm: build OK
2026-Jul-13 16:49:16 :: [riscv64] #200 kontainer-1.5.0-alt1.src.rpm: build start
2026-Jul-13 16:55:04 :: [riscv64] #200 kontainer-1.5.0-alt1.src.rpm: build OK
2026-Jul-13 16:55:04 :: 100: build check OK
2026-Jul-13 16:55:05 :: 200: build check OK
2026-Jul-13 16:55:05 :: build check OK
2026-Jul-13 16:55:05 :: #100: qdia-0.65-alt1.src.rpm: version check OK
2026-Jul-13 16:55:06 :: #200: kontainer-1.5.0-alt1.src.rpm: version check OK
2026-Jul-13 16:55:06 :: build version check OK
2026-Jul-13 16:55:06 :: noarch check OK
2026-Jul-13 16:55:07 :: plan: src +2 -2 =21280, riscv64 +4 -4 =37621
#200 kontainer 1.4.1-alt1 -> 1.5.0-alt1
 Mon Jul 13 2026 Nikolay Strelkov <snk at altlinux.org> 1.5.0-alt1
 - New version 1.5.0.
#100 qdia 0.64-alt1 -> 0.65-alt1
 Mon Jul 13 2026 Nikolay Strelkov <snk at altlinux.org> 0.65-alt1
 - New version 0.65.
2026-Jul-13 16:55:31 :: patched apt indices
2026-Jul-13 16:55:33 :: created next repo
2026-Jul-13 16:55:43 :: duplicate provides check OK
2026-Jul-13 16:56:08 :: dependencies check OK
2026-Jul-13 16:56:30 :: [riscv64] ELF symbols check OK
2026-Jul-13 16:56:45 :: [riscv64.0] #200 kontainer: install check start
2026-Jul-13 16:56:45 :: [riscv64.1] #100 qdia: install check start
	riscv64: qdia=0.65-alt1 post-install unowned files:
 /usr/share/icons/hicolor/scalable
 /usr/share/icons/hicolor/scalable/apps
2026-Jul-13 16:58:20 :: [riscv64.1] #100 qdia: install check OK
Timeout, server 10.64.20.42 not responding.
ssh: connect to host 10.64.20.42 port 22: No route to host
2026-Jul-13 17:00:47 :: [riscv64.0] #200 kontainer: install check FAILED
2026-Jul-13 17:00:47 :: [riscv64] requesting cancellation of task processing
ssh: connect to host 10.64.20.42 port 22: No route to host
rsync: connection unexpectedly closed (0 bytes received so far) [Receiver]
rsync error: unexplained error (code 255) at io.c(232) [Receiver=3.2.7]
ssh: connect to host 10.64.20.42 port 22: No route to host
rsync: connection unexpectedly closed (0 bytes received so far) [Receiver]
rsync error: unexplained error (code 255) at io.c(232) [Receiver=3.2.7]
ssh: connect to host 10.64.20.42 port 22: No route to host
rsync: connection unexpectedly closed (0 bytes received so far) [Receiver]
rsync error: unexplained error (code 255) at io.c(232) [Receiver=3.2.7]
ssh: connect to host 10.64.20.42 port 22: No route to host
rsync: connection unexpectedly closed (0 bytes received so far) [Receiver]
rsync error: unexplained error (code 255) at io.c(232) [Receiver=3.2.7]
ssh: connect to host 10.64.20.42 port 22: No route to host
rsync: connection unexpectedly closed (0 bytes received so far) [Receiver]
rsync error: unexplained error (code 255) at io.c(232) [Receiver=3.2.7]
ssh: connect to host 10.64.20.42 port 22: No route to host
rsync: connection unexpectedly closed (0 bytes received so far) [Receiver]
rsync error: unexplained error (code 255) at io.c(232) [Receiver=3.2.7]
ssh: connect to host 10.64.20.42 port 22: No route to host
rsync: connection unexpectedly closed (0 bytes received so far) [Receiver]
rsync error: unexplained error (code 255) at io.c(232) [Receiver=3.2.7]
ssh: connect to host 10.64.20.42 port 22: No route to host
rsync: connection unexpectedly closed (0 bytes received so far) [Receiver]
rsync error: unexplained error (code 255) at io.c(232) [Receiver=3.2.7]
ssh: connect to host 10.64.20.42 port 22: No route to host
rsync: connection unexpectedly closed (0 bytes received so far) [Receiver]
rsync error: unexplained error (code 255) at io.c(232) [Receiver=3.2.7]
ssh: connect to host 10.64.20.42 port 22: No route to host
rsync: connection unexpectedly closed (0 bytes received so far) [Receiver]
rsync error: unexplained error (code 255) at io.c(232) [Receiver=3.2.7]
ssh: connect to host 10.64.20.42 port 22: No route to host
rsync: connection unexpectedly closed (0 bytes received so far) [Receiver]
rsync error: unexplained error (code 255) at io.c(232) [Receiver=3.2.7]
ssh: connect to host 10.64.20.42 port 22: No route to host
rsync: connection unexpectedly closed (0 bytes received so far) [Receiver]
rsync error: unexplained error (code 255) at io.c(232) [Receiver=3.2.7]
ssh: connect to host 10.64.20.42 port 22: No route to host
rsync: connection unexpectedly closed (0 bytes received so far) [Receiver]
rsync error: unexplained error (code 255) at io.c(232) [Receiver=3.2.7]
rsync: [sender] change_dir "/tmp/homes/builder0/install/0" failed: No such file or directory (2)
rsync error: some files/attrs were not transferred (see previous errors) (code 23) at main.c(1863) [Receiver=3.2.7]
rsync: [Receiver] write error: Broken pipe (32)
rsync: [sender] change_dir "/tmp/homes/builder0/install/0" failed: No such file or directory (2)
rsync error: some files/attrs were not transferred (see previous errors) (code 23) at main.c(1863) [Receiver=3.2.7]
rsync: [Receiver] write error: Broken pipe (32)
rsync: [sender] change_dir "/tmp/homes/builder0/install/0" failed: No such file or directory (2)
rsync error: some files/attrs were not transferred (see previous errors) (code 23) at main.c(1863) [Receiver=3.2.7]
rsync: [Receiver] write error: Broken pipe (32)
rsync: [sender] change_dir "/tmp/homes/builder0/install/0" failed: No such file or directory (2)
rsync error: some files/attrs were not transferred (see previous errors) (code 23) at main.c(1863) [Receiver=3.2.7]
rsync: [Receiver] write error: Broken pipe (32)
rsync: [sender] change_dir "/tmp/homes/builder0/install/0" failed: No such file or directory (2)
rsync error: some files/attrs were not transferred (see previous errors) (code 23) at main.c(1863) [Receiver=3.2.7]
rsync: [Receiver] write error: Broken pipe (32)
rsync: [sender] change_dir "/tmp/homes/builder0/install/0" failed: No such file or directory (2)
rsync error: some files/attrs were not transferred (see previous errors) (code 23) at main.c(1863) [Receiver=3.2.7]
rsync: [Receiver] write error: Broken pipe (32)
rsync: [sender] change_dir "/tmp/homes/builder0/install/0" failed: No such file or directory (2)
rsync error: some files/attrs were not transferred (see previous errors) (code 23) at main.c(1863) [Receiver=3.2.7]
rsync: [Receiver] write error: Broken pipe (32)
rsync: [sender] change_dir "/tmp/homes/builder0/install/0" failed: No such file or directory (2)
rsync error: some files/attrs were not transferred (see previous errors) (code 23) at main.c(1863) [Receiver=3.2.7]
rsync: [Receiver] write error: Broken pipe (32)
rsync: [sender] change_dir "/tmp/homes/builder0/install/0" failed: No such file or directory (2)
rsync error: some files/attrs were not transferred (see previous errors) (code 23) at main.c(1863) [Receiver=3.2.7]
rsync: [Receiver] write error: Broken pipe (32)
rsync: [sender] change_dir "/tmp/homes/builder0/install/0" failed: No such file or directory (2)
rsync error: some files/attrs were not transferred (see previous errors) (code 23) at main.c(1863) [Receiver=3.2.7]
rsync: [Receiver] write error: Broken pipe (32)
rsync: [sender] change_dir "/tmp/homes/builder0/install/0" failed: No such file or directory (2)
rsync error: some files/attrs were not transferred (see previous errors) (code 23) at main.c(1863) [Receiver=3.2.7]
rsync: [Receiver] write error: Broken pipe (32)
rsync: [sender] change_dir "/tmp/homes/builder0/install/0" failed: No such file or directory (2)
rsync error: some files/attrs were not transferred (see previous errors) (code 23) at main.c(1863) [Receiver=3.2.7]
rsync: [Receiver] write error: Broken pipe (32)
rsync: [sender] change_dir "/tmp/homes/builder0/install/0" failed: No such file or directory (2)
rsync error: some files/attrs were not transferred (see previous errors) (code 23) at main.c(1863) [Receiver=3.2.7]
rsync: [Receiver] write error: Broken pipe (32)
rsync: [sender] change_dir "/tmp/homes/builder0/install/0" failed: No such file or directory (2)
rsync error: some files/attrs were not transferred (see previous errors) (code 23) at main.c(1863) [Receiver=3.2.7]
rsync: [Receiver] write error: Broken pipe (32)
rsync: [sender] change_dir "/tmp/homes/builder0/install/0" failed: No such file or directory (2)
rsync error: some files/attrs were not transferred (see previous errors) (code 23) at main.c(1863) [Receiver=3.2.7]
rsync: [Receiver] write error: Broken pipe (32)
rsync: [sender] change_dir "/tmp/homes/builder0/install/0" failed: No such file or directory (2)
rsync error: some files/attrs were not transferred (see previous errors) (code 23) at main.c(1863) [Receiver=3.2.7]
rsync: [Receiver] write error: Broken pipe (32)
rsync: [sender] change_dir "/tmp/homes/builder0/install/0" failed: No such file or directory (2)
rsync error: some files/attrs were not transferred (see previous errors) (code 23) at main.c(1863) [Receiver=3.2.7]
rsync: [Receiver] write error: Broken pipe (32)
rsync: [sender] change_dir "/tmp/homes/builder0/install/0" failed: No such file or directory (2)
rsync error: some files/attrs were not transferred (see previous errors) (code 23) at main.c(1863) [Receiver=3.2.7]
rsync: [Receiver] write error: Broken pipe (32)
rsync: [sender] change_dir "/tmp/homes/builder0/install/0" failed: No such file or directory (2)
rsync error: some files/attrs were not transferred (see previous errors) (code 23) at main.c(1863) [Receiver=3.2.7]
rsync: [Receiver] write error: Broken pipe (32)
rsync: [sender] change_dir "/tmp/homes/builder0/install/0" failed: No such file or directory (2)
rsync error: some files/attrs were not transferred (see previous errors) (code 23) at main.c(1863) [Receiver=3.2.7]
rsync: [Receiver] write error: Broken pipe (32)
rsync: [sender] change_dir "/tmp/homes/builder0/install/0" failed: No such file or directory (2)
rsync error: some files/attrs were not transferred (see previous errors) (code 23) at main.c(1863) [Receiver=3.2.7]
rsync: [Receiver] write error: Broken pipe (32)
rsync: [sender] change_dir "/tmp/homes/builder0/install/0" failed: No such file or directory (2)
rsync error: some files/attrs were not transferred (see previous errors) (code 23) at main.c(1863) [Receiver=3.2.7]
rsync: [Receiver] write error: Broken pipe (32)
rsync: [sender] change_dir "/tmp/homes/builder0/install/0" failed: No such file or directory (2)
rsync error: some files/attrs were not transferred (see previous errors) (code 23) at main.c(1863) [Receiver=3.2.7]
rsync: [Receiver] write error: Broken pipe (32)
rsync: [sender] change_dir "/tmp/homes/builder0/install/0" failed: No such file or directory (2)
rsync error: some files/attrs were not transferred (see previous errors) (code 23) at main.c(1863) [Receiver=3.2.7]
rsync: [Receiver] write error: Broken pipe (32)
rsync: [sender] change_dir "/tmp/homes/builder0/install/0" failed: No such file or directory (2)
rsync error: some files/attrs were not transferred (see previous errors) (code 23) at main.c(1863) [Receiver=3.2.7]
rsync: [Receiver] write error: Broken pipe (32)
rsync: [sender] change_dir "/tmp/homes/builder0/install/0" failed: No such file or directory (2)
rsync error: some files/attrs were not transferred (see previous errors) (code 23) at main.c(1863) [Receiver=3.2.7]
rsync: [Receiver] write error: Broken pipe (32)
rsync: [sender] change_dir "/tmp/homes/builder0/install/0" failed: No such file or directory (2)
rsync error: some files/attrs were not transferred (see previous errors) (code 23) at main.c(1863) [Receiver=3.2.7]
rsync: [Receiver] write error: Broken pipe (32)
rsync: [sender] change_dir "/tmp/homes/builder0/install/0" failed: No such file or directory (2)
rsync error: some files/attrs were not transferred (see previous errors) (code 23) at main.c(1863) [Receiver=3.2.7]
rsync: [Receiver] write error: Broken pipe (32)
rsync: [sender] change_dir "/tmp/homes/builder0/install/0" failed: No such file or directory (2)
rsync error: some files/attrs were not transferred (see previous errors) (code 23) at main.c(1863) [Receiver=3.2.7]
rsync: [Receiver] write error: Broken pipe (32)
rsync: [sender] change_dir "/tmp/homes/builder0/install/0" failed: No such file or directory (2)
rsync error: some files/attrs were not transferred (see previous errors) (code 23) at main.c(1863) [Receiver=3.2.7]
rsync: [Receiver] write error: Broken pipe (32)
rsync: [sender] change_dir "/tmp/homes/builder0/install/0" failed: No such file or directory (2)
rsync error: some files/attrs were not transferred (see previous errors) (code 23) at main.c(1863) [Receiver=3.2.7]
rsync: [Receiver] write error: Broken pipe (32)
rsync: [sender] change_dir "/tmp/homes/builder0/install/0" failed: No such file or directory (2)
rsync error: some files/attrs were not transferred (see previous errors) (code 23) at main.c(1863) [Receiver=3.2.7]
rsync: [Receiver] write error: Broken pipe (32)
rsync: [sender] change_dir "/tmp/homes/builder0/install/0" failed: No such file or directory (2)
rsync error: some files/attrs were not transferred (see previous errors) (code 23) at main.c(1863) [Receiver=3.2.7]
rsync: [Receiver] write error: Broken pipe (32)
rsync: [sender] change_dir "/tmp/homes/builder0/install/0" failed: No such file or directory (2)
rsync error: some files/attrs were not transferred (see previous errors) (code 23) at main.c(1863) [Receiver=3.2.7]
rsync: [Receiver] write error: Broken pipe (32)
rsync: [sender] change_dir "/tmp/homes/builder0/install/0" failed: No such file or directory (2)
rsync error: some files/attrs were not transferred (see previous errors) (code 23) at main.c(1863) [Receiver=3.2.7]
rsync: [Receiver] write error: Broken pipe (32)
rsync: [sender] change_dir "/tmp/homes/builder0/install/0" failed: No such file or directory (2)
rsync error: some files/attrs were not transferred (see previous errors) (code 23) at main.c(1863) [Receiver=3.2.7]
rsync: [Receiver] write error: Broken pipe (32)
rsync: [sender] change_dir "/tmp/homes/builder0/install/0" failed: No such file or directory (2)
rsync error: some files/attrs were not transferred (see previous errors) (code 23) at main.c(1863) [Receiver=3.2.7]
rsync: [Receiver] write error: Broken pipe (32)
rsync: [sender] change_dir "/tmp/homes/builder0/install/0" failed: No such file or directory (2)
rsync error: some files/attrs were not transferred (see previous errors) (code 23) at main.c(1863) [Receiver=3.2.7]
rsync: [Receiver] write error: Broken pipe (32)
rsync: [sender] change_dir "/tmp/homes/builder0/install/0" failed: No such file or directory (2)
rsync error: some files/attrs were not transferred (see previous errors) (code 23) at main.c(1863) [Receiver=3.2.7]
rsync: [Receiver] write error: Broken pipe (32)
rsync: [sender] change_dir "/tmp/homes/builder0/install/0" failed: No such file or directory (2)
rsync error: some files/attrs were not transferred (see previous errors) (code 23) at main.c(1863) [Receiver=3.2.7]
rsync: [Receiver] write error: Broken pipe (32)
rsync: [sender] change_dir "/tmp/homes/builder0/install/0" failed: No such file or directory (2)
rsync error: some files/attrs were not transferred (see previous errors) (code 23) at main.c(1863) [Receiver=3.2.7]
rsync: [Receiver] write error: Broken pipe (32)
rsync: [sender] change_dir "/tmp/homes/builder0/install/0" failed: No such file or directory (2)
rsync error: some files/attrs were not transferred (see previous errors) (code 23) at main.c(1863) [Receiver=3.2.7]
rsync: [Receiver] write error: Broken pipe (32)
rsync: [sender] change_dir "/tmp/homes/builder0/install/0" failed: No such file or directory (2)
rsync error: some files/attrs were not transferred (see previous errors) (code 23) at main.c(1863) [Receiver=3.2.7]
rsync: [Receiver] write error: Broken pipe (32)
rsync: [sender] change_dir "/tmp/homes/builder0/install/0" failed: No such file or directory (2)
rsync error: some files/attrs were not transferred (see previous errors) (code 23) at main.c(1863) [Receiver=3.2.7]
rsync: [Receiver] write error: Broken pipe (32)
rsync: [sender] change_dir "/tmp/homes/builder0/install/0" failed: No such file or directory (2)
rsync error: some files/attrs were not transferred (see previous errors) (code 23) at main.c(1863) [Receiver=3.2.7]
rsync: [Receiver] write error: Broken pipe (32)
rsync: [sender] change_dir "/tmp/homes/builder0/install/0" failed: No such file or directory (2)
rsync error: some files/attrs were not transferred (see previous errors) (code 23) at main.c(1863) [Receiver=3.2.7]
rsync: [Receiver] write error: Broken pipe (32)
rsync: [sender] change_dir "/tmp/homes/builder0/install/0" failed: No such file or directory (2)
rsync error: some files/attrs were not transferred (see previous errors) (code 23) at main.c(1863) [Receiver=3.2.7]
rsync: [Receiver] write error: Broken pipe (32)
rsync: [sender] change_dir "/tmp/homes/builder0/install/0" failed: No such file or directory (2)
rsync error: some files/attrs were not transferred (see previous errors) (code 23) at main.c(1863) [Receiver=3.2.7]
rsync: [Receiver] write error: Broken pipe (32)
rsync: [sender] change_dir "/tmp/homes/builder0/install/0" failed: No such file or directory (2)
rsync error: some files/attrs were not transferred (see previous errors) (code 23) at main.c(1863) [Receiver=3.2.7]
rsync: [Receiver] write error: Broken pipe (32)
rsync: [sender] change_dir "/tmp/homes/builder0/install/0" failed: No such file or directory (2)
rsync error: some files/attrs were not transferred (see previous errors) (code 23) at main.c(1863) [Receiver=3.2.7]
rsync: [Receiver] write error: Broken pipe (32)
rsync: [sender] change_dir "/tmp/homes/builder0/install/0" failed: No such file or directory (2)
rsync error: some files/attrs were not transferred (see previous errors) (code 23) at main.c(1863) [Receiver=3.2.7]
rsync: [Receiver] write error: Broken pipe (32)
rsync: [sender] change_dir "/tmp/homes/builder0/install/0" failed: No such file or directory (2)
rsync error: some files/attrs were not transferred (see previous errors) (code 23) at main.c(1863) [Receiver=3.2.7]
rsync: [Receiver] write error: Broken pipe (32)
rsync: [sender] change_dir "/tmp/homes/builder0/install/0" failed: No such file or directory (2)
rsync error: some files/attrs were not transferred (see previous errors) (code 23) at main.c(1863) [Receiver=3.2.7]
rsync: [Receiver] write error: Broken pipe (32)
rsync: [sender] change_dir "/tmp/homes/builder0/install/0" failed: No such file or directory (2)
rsync error: some files/attrs were not transferred (see previous errors) (code 23) at main.c(1863) [Receiver=3.2.7]
rsync: [Receiver] write error: Broken pipe (32)
rsync: [sender] change_dir "/tmp/homes/builder0/install/0" failed: No such file or directory (2)
rsync error: some files/attrs were not transferred (see previous errors) (code 23) at main.c(1863) [Receiver=3.2.7]
rsync: [Receiver] write error: Broken pipe (32)
rsync: [sender] change_dir "/tmp/homes/builder0/install/0" failed: No such file or directory (2)
rsync error: some files/attrs were not transferred (see previous errors) (code 23) at main.c(1863) [Receiver=3.2.7]
rsync: [Receiver] write error: Broken pipe (32)
rsync: [sender] change_dir "/tmp/homes/builder0/install/0" failed: No such file or directory (2)
rsync error: some files/attrs were not transferred (see previous errors) (code 23) at main.c(1863) [Receiver=3.2.7]
rsync: [Receiver] write error: Broken pipe (32)
rsync: [sender] change_dir "/tmp/homes/builder0/install/0" failed: No such file or directory (2)
rsync error: some files/attrs were not transferred (see previous errors) (code 23) at main.c(1863) [Receiver=3.2.7]
rsync: [Receiver] write error: Broken pipe (32)
rsync: [sender] change_dir "/tmp/homes/builder0/install/0" failed: No such file or directory (2)
rsync error: some files/attrs were not transferred (see previous errors) (code 23) at main.c(1863) [Receiver=3.2.7]
rsync: [Receiver] write error: Broken pipe (32)
rsync: [sender] change_dir "/tmp/homes/builder0/install/0" failed: No such file or directory (2)
rsync error: some files/attrs were not transferred (see previous errors) (code 23) at main.c(1863) [Receiver=3.2.7]
rsync: [Receiver] write error: Broken pipe (32)
rsync: [sender] change_dir "/tmp/homes/builder0/install/0" failed: No such file or directory (2)
rsync error: some files/attrs were not transferred (see previous errors) (code 23) at main.c(1863) [Receiver=3.2.7]
rsync: [Receiver] write error: Broken pipe (32)
rsync: [sender] change_dir "/tmp/homes/builder0/install/0" failed: No such file or directory (2)
rsync error: some files/attrs were not transferred (see previous errors) (code 23) at main.c(1863) [Receiver=3.2.7]
rsync: [Receiver] write error: Broken pipe (32)
rsync: [sender] change_dir "/tmp/homes/builder0/install/0" failed: No such file or directory (2)
rsync error: some files/attrs were not transferred (see previous errors) (code 23) at main.c(1863) [Receiver=3.2.7]
rsync: [Receiver] write error: Broken pipe (32)
rsync: [sender] change_dir "/tmp/homes/builder0/install/0" failed: No such file or directory (2)
rsync error: some files/attrs were not transferred (see previous errors) (code 23) at main.c(1863) [Receiver=3.2.7]
rsync: [Receiver] write error: Broken pipe (32)
rsync: [sender] change_dir "/tmp/homes/builder0/install/0" failed: No such file or directory (2)
rsync error: some files/attrs were not transferred (see previous errors) (code 23) at main.c(1863) [Receiver=3.2.7]
rsync: [Receiver] write error: Broken pipe (32)
rsync: [sender] change_dir "/tmp/homes/builder0/install/0" failed: No such file or directory (2)
rsync error: some files/attrs were not transferred (see previous errors) (code 23) at main.c(1863) [Receiver=3.2.7]
rsync: [Receiver] write error: Broken pipe (32)
rsync: [sender] change_dir "/tmp/homes/builder0/install/0" failed: No such file or directory (2)
rsync error: some files/attrs were not transferred (see previous errors) (code 23) at main.c(1863) [Receiver=3.2.7]
rsync: [Receiver] write error: Broken pipe (32)
rsync: [sender] change_dir "/tmp/homes/builder0/install/0" failed: No such file or directory (2)
rsync error: some files/attrs were not transferred (see previous errors) (code 23) at main.c(1863) [Receiver=3.2.7]
rsync: [Receiver] write error: Broken pipe (32)
rsync: [sender] change_dir "/tmp/homes/builder0/install/0" failed: No such file or directory (2)
rsync error: some files/attrs were not transferred (see previous errors) (code 23) at main.c(1863) [Receiver=3.2.7]
rsync: [Receiver] write error: Broken pipe (32)
rsync: [sender] change_dir "/tmp/homes/builder0/install/0" failed: No such file or directory (2)
rsync error: some files/attrs were not transferred (see previous errors) (code 23) at main.c(1863) [Receiver=3.2.7]
rsync: [Receiver] write error: Broken pipe (32)
rsync: [sender] change_dir "/tmp/homes/builder0/install/0" failed: No such file or directory (2)
rsync error: some files/attrs were not transferred (see previous errors) (code 23) at main.c(1863) [Receiver=3.2.7]
rsync: [Receiver] write error: Broken pipe (32)
rsync: [sender] change_dir "/tmp/homes/builder0/install/0" failed: No such file or directory (2)
rsync error: some files/attrs were not transferred (see previous errors) (code 23) at main.c(1863) [Receiver=3.2.7]
rsync: [Receiver] write error: Broken pipe (32)
rsync: [sender] change_dir "/tmp/homes/builder0/install/0" failed: No such file or directory (2)
rsync error: some files/attrs were not transferred (see previous errors) (code 23) at main.c(1863) [Receiver=3.2.7]
rsync: [Receiver] write error: Broken pipe (32)
rsync: [sender] change_dir "/tmp/homes/builder0/install/0" failed: No such file or directory (2)
rsync error: some files/attrs were not transferred (see previous errors) (code 23) at main.c(1863) [Receiver=3.2.7]
rsync: [Receiver] write error: Broken pipe (32)
rsync: [sender] change_dir "/tmp/homes/builder0/install/0" failed: No such file or directory (2)
rsync error: some files/attrs were not transferred (see previous errors) (code 23) at main.c(1863) [Receiver=3.2.7]
rsync: [Receiver] write error: Broken pipe (32)
rsync: [sender] change_dir "/tmp/homes/builder0/install/0" failed: No such file or directory (2)
rsync error: some files/attrs were not transferred (see previous errors) (code 23) at main.c(1863) [Receiver=3.2.7]
rsync: [Receiver] write error: Broken pipe (32)
rsync: [sender] change_dir "/tmp/homes/builder0/install/0" failed: No such file or directory (2)
rsync error: some files/attrs were not transferred (see previous errors) (code 23) at main.c(1863) [Receiver=3.2.7]
rsync: [Receiver] write error: Broken pipe (32)
rsync: [sender] change_dir "/tmp/homes/builder0/install/0" failed: No such file or directory (2)
rsync error: some files/attrs were not transferred (see previous errors) (code 23) at main.c(1863) [Receiver=3.2.7]
rsync: [Receiver] write error: Broken pipe (32)
rsync: [sender] change_dir "/tmp/homes/builder0/install/0" failed: No such file or directory (2)
rsync error: some files/attrs were not transferred (see previous errors) (code 23) at main.c(1863) [Receiver=3.2.7]
rsync: [Receiver] write error: Broken pipe (32)
rsync: [sender] change_dir "/tmp/homes/builder0/install/0" failed: No such file or directory (2)
rsync error: some files/attrs were not transferred (see previous errors) (code 23) at main.c(1863) [Receiver=3.2.7]
rsync: [Receiver] write error: Broken pipe (32)
rsync: [sender] change_dir "/tmp/homes/builder0/install/0" failed: No such file or directory (2)
rsync error: some files/attrs were not transferred (see previous errors) (code 23) at main.c(1863) [Receiver=3.2.7]
rsync: [Receiver] write error: Broken pipe (32)
rsync: [sender] change_dir "/tmp/homes/builder0/install/0" failed: No such file or directory (2)
rsync error: some files/attrs were not transferred (see previous errors) (code 23) at main.c(1863) [Receiver=3.2.7]
rsync: [Receiver] write error: Broken pipe (32)
rsync: [sender] change_dir "/tmp/homes/builder0/install/0" failed: No such file or directory (2)
rsync error: some files/attrs were not transferred (see previous errors) (code 23) at main.c(1863) [Receiver=3.2.7]
rsync: [Receiver] write error: Broken pipe (32)
rsync: [sender] change_dir "/tmp/homes/builder0/install/0" failed: No such file or directory (2)
rsync error: some files/attrs were not transferred (see previous errors) (code 23) at main.c(1863) [Receiver=3.2.7]
rsync: [Receiver] write error: Broken pipe (32)
rsync: [sender] change_dir "/tmp/homes/builder0/install/0" failed: No such file or directory (2)
rsync error: some files/attrs were not transferred (see previous errors) (code 23) at main.c(1863) [Receiver=3.2.7]
rsync: [Receiver] write error: Broken pipe (32)
rsync: [sender] change_dir "/tmp/homes/builder0/install/0" failed: No such file or directory (2)
rsync error: some files/attrs were not transferred (see previous errors) (code 23) at main.c(1863) [Receiver=3.2.7]
rsync: [Receiver] write error: Broken pipe (32)
rsync: [sender] change_dir "/tmp/homes/builder0/install/0" failed: No such file or directory (2)
rsync error: some files/attrs were not transferred (see previous errors) (code 23) at main.c(1863) [Receiver=3.2.7]
rsync: [Receiver] write error: Broken pipe (32)
rsync: [sender] change_dir "/tmp/homes/builder0/install/0" failed: No such file or directory (2)
rsync error: some files/attrs were not transferred (see previous errors) (code 23) at main.c(1863) [Receiver=3.2.7]
rsync: [Receiver] write error: Broken pipe (32)
rsync: [sender] change_dir "/tmp/homes/builder0/install/0" failed: No such file or directory (2)
rsync error: some files/attrs were not transferred (see previous errors) (code 23) at main.c(1863) [Receiver=3.2.7]
rsync: [Receiver] write error: Broken pipe (32)
rsync: [sender] change_dir "/tmp/homes/builder0/install/0" failed: No such file or directory (2)
rsync error: some files/attrs were not transferred (see previous errors) (code 23) at main.c(1863) [Receiver=3.2.7]
rsync: [Receiver] write error: Broken pipe (32)
rsync: [sender] change_dir "/tmp/homes/builder0/install/0" failed: No such file or directory (2)
rsync error: some files/attrs were not transferred (see previous errors) (code 23) at main.c(1863) [Receiver=3.2.7]
rsync: [Receiver] write error: Broken pipe (32)
rsync: [sender] change_dir "/tmp/homes/builder0/install/0" failed: No such file or directory (2)
rsync error: some files/attrs were not transferred (see previous errors) (code 23) at main.c(1863) [Receiver=3.2.7]
rsync: [Receiver] write error: Broken pipe (32)
rsync: [sender] change_dir "/tmp/homes/builder0/install/0" failed: No such file or directory (2)
rsync error: some files/attrs were not transferred (see previous errors) (code 23) at main.c(1863) [Receiver=3.2.7]
rsync: [Receiver] write error: Broken pipe (32)
rsync: [sender] change_dir "/tmp/homes/builder0/install/0" failed: No such file or directory (2)
rsync error: some files/attrs were not transferred (see previous errors) (code 23) at main.c(1863) [Receiver=3.2.7]
rsync: [Receiver] write error: Broken pipe (32)
rsync: [sender] change_dir "/tmp/homes/builder0/install/0" failed: No such file or directory (2)
rsync error: some files/attrs were not transferred (see previous errors) (code 23) at main.c(1863) [Receiver=3.2.7]
rsync: [Receiver] write error: Broken pipe (32)
rsync: [sender] change_dir "/tmp/homes/builder0/install/0" failed: No such file or directory (2)
rsync error: some files/attrs were not transferred (see previous errors) (code 23) at main.c(1863) [Receiver=3.2.7]
rsync: [Receiver] write error: Broken pipe (32)
rsync: [sender] change_dir "/tmp/homes/builder0/install/0" failed: No such file or directory (2)
rsync error: some files/attrs were not transferred (see previous errors) (code 23) at main.c(1863) [Receiver=3.2.7]
rsync: [Receiver] write error: Broken pipe (32)
rsync: [sender] change_dir "/tmp/homes/builder0/install/0" failed: No such file or directory (2)
rsync error: some files/attrs were not transferred (see previous errors) (code 23) at main.c(1863) [Receiver=3.2.7]
rsync: [Receiver] write error: Broken pipe (32)
rsync: [sender] change_dir "/tmp/homes/builder0/install/0" failed: No such file or directory (2)
rsync error: some files/attrs were not transferred (see previous errors) (code 23) at main.c(1863) [Receiver=3.2.7]
rsync: [Receiver] write error: Broken pipe (32)
rsync: [sender] change_dir "/tmp/homes/builder0/install/0" failed: No such file or directory (2)
rsync error: some files/attrs were not transferred (see previous errors) (code 23) at main.c(1863) [Receiver=3.2.7]
rsync: [Receiver] write error: Broken pipe (32)
rsync: [sender] change_dir "/tmp/homes/builder0/install/0" failed: No such file or directory (2)
rsync error: some files/attrs were not transferred (see previous errors) (code 23) at main.c(1863) [Receiver=3.2.7]
rsync: [Receiver] write error: Broken pipe (32)
rsync: [sender] change_dir "/tmp/homes/builder0/install/0" failed: No such file or directory (2)
rsync error: some files/attrs were not transferred (see previous errors) (code 23) at main.c(1863) [Receiver=3.2.7]
rsync: [Receiver] write error: Broken pipe (32)
rsync: [sender] change_dir "/tmp/homes/builder0/install/0" failed: No such file or directory (2)
rsync error: some files/attrs were not transferred (see previous errors) (code 23) at main.c(1863) [Receiver=3.2.7]
rsync: [Receiver] write error: Broken pipe (32)
rsync: [sender] change_dir "/tmp/homes/builder0/install/0" failed: No such file or directory (2)
rsync error: some files/attrs were not transferred (see previous errors) (code 23) at main.c(1863) [Receiver=3.2.7]
rsync: [Receiver] write error: Broken pipe (32)
rsync: [sender] change_dir "/tmp/homes/builder0/install/0" failed: No such file or directory (2)
rsync error: some files/attrs were not transferred (see previous errors) (code 23) at main.c(1863) [Receiver=3.2.7]
rsync: [Receiver] write error: Broken pipe (32)
rsync: [sender] change_dir "/tmp/homes/builder0/install/0" failed: No such file or directory (2)
rsync error: some files/attrs were not transferred (see previous errors) (code 23) at main.c(1863) [Receiver=3.2.7]
rsync: [Receiver] write error: Broken pipe (32)
rsync: [sender] change_dir "/tmp/homes/builder0/install/0" failed: No such file or directory (2)
rsync error: some files/attrs were not transferred (see previous errors) (code 23) at main.c(1863) [Receiver=3.2.7]
rsync: [Receiver] write error: Broken pipe (32)
rsync: [sender] change_dir "/tmp/homes/builder0/install/0" failed: No such file or directory (2)
rsync error: some files/attrs were not transferred (see previous errors) (code 23) at main.c(1863) [Receiver=3.2.7]
rsync: [Receiver] write error: Broken pipe (32)
rsync: [sender] change_dir "/tmp/homes/builder0/install/0" failed: No such file or directory (2)
rsync error: some files/attrs were not transferred (see previous errors) (code 23) at main.c(1863) [Receiver=3.2.7]
rsync: [Receiver] write error: Broken pipe (32)
rsync: [sender] change_dir "/tmp/homes/builder0/install/0" failed: No such file or directory (2)
rsync error: some files/attrs were not transferred (see previous errors) (code 23) at main.c(1863) [Receiver=3.2.7]
rsync: [Receiver] write error: Broken pipe (32)
rsync: [sender] change_dir "/tmp/homes/builder0/install/0" failed: No such file or directory (2)
rsync error: some files/attrs were not transferred (see previous errors) (code 23) at main.c(1863) [Receiver=3.2.7]
rsync: [Receiver] write error: Broken pipe (32)
rsync: [sender] change_dir "/tmp/homes/builder0/install/0" failed: No such file or directory (2)
rsync error: some files/attrs were not transferred (see previous errors) (code 23) at main.c(1863) [Receiver=3.2.7]
rsync: [Receiver] write error: Broken pipe (32)
rsync: [sender] change_dir "/tmp/homes/builder0/install/0" failed: No such file or directory (2)
rsync error: some files/attrs were not transferred (see previous errors) (code 23) at main.c(1863) [Receiver=3.2.7]
rsync: [Receiver] write error: Broken pipe (32)
rsync: [sender] change_dir "/tmp/homes/builder0/install/0" failed: No such file or directory (2)
rsync error: some files/attrs were not transferred (see previous errors) (code 23) at main.c(1863) [Receiver=3.2.7]
rsync: [Receiver] write error: Broken pipe (32)
rsync: [sender] change_dir "/tmp/homes/builder0/install/0" failed: No such file or directory (2)
rsync error: some files/attrs were not transferred (see previous errors) (code 23) at main.c(1863) [Receiver=3.2.7]
rsync: [Receiver] write error: Broken pipe (32)
rsync: [sender] change_dir "/tmp/homes/builder0/install/0" failed: No such file or directory (2)
rsync error: some files/attrs were not transferred (see previous errors) (code 23) at main.c(1863) [Receiver=3.2.7]
rsync: [Receiver] write error: Broken pipe (32)
rsync: [sender] change_dir "/tmp/homes/builder0/install/0" failed: No such file or directory (2)
rsync error: some files/attrs were not transferred (see previous errors) (code 23) at main.c(1863) [Receiver=3.2.7]
rsync: [Receiver] write error: Broken pipe (32)
rsync: [sender] change_dir "/tmp/homes/builder0/install/0" failed: No such file or directory (2)
rsync error: some files/attrs were not transferred (see previous errors) (code 23) at main.c(1863) [Receiver=3.2.7]
rsync: [Receiver] write error: Broken pipe (32)
rsync: [sender] change_dir "/tmp/homes/builder0/install/0" failed: No such file or directory (2)
rsync error: some files/attrs were not transferred (see previous errors) (code 23) at main.c(1863) [Receiver=3.2.7]
rsync: [Receiver] write error: Broken pipe (32)
rsync: [sender] change_dir "/tmp/homes/builder0/install/0" failed: No such file or directory (2)
rsync error: some files/attrs were not transferred (see previous errors) (code 23) at main.c(1863) [Receiver=3.2.7]
rsync: [Receiver] write error: Broken pipe (32)
rsync: [sender] change_dir "/tmp/homes/builder0/install/0" failed: No such file or directory (2)
rsync error: some files/attrs were not transferred (see previous errors) (code 23) at main.c(1863) [Receiver=3.2.7]
rsync: [Receiver] write error: Broken pipe (32)
rsync: [sender] change_dir "/tmp/homes/builder0/install/0" failed: No such file or directory (2)
rsync error: some files/attrs were not transferred (see previous errors) (code 23) at main.c(1863) [Receiver=3.2.7]
rsync: [Receiver] write error: Broken pipe (32)
rsync: [sender] change_dir "/tmp/homes/builder0/install/0" failed: No such file or directory (2)
rsync error: some files/attrs were not transferred (see previous errors) (code 23) at main.c(1863) [Receiver=3.2.7]
rsync: [Receiver] write error: Broken pipe (32)
rsync: [sender] change_dir "/tmp/homes/builder0/install/0" failed: No such file or directory (2)
rsync error: some files/attrs were not transferred (see previous errors) (code 23) at main.c(1863) [Receiver=3.2.7]
rsync: [Receiver] write error: Broken pipe (32)
rsync: [sender] change_dir "/tmp/homes/builder0/install/0" failed: No such file or directory (2)
rsync error: some files/attrs were not transferred (see previous errors) (code 23) at main.c(1863) [Receiver=3.2.7]
rsync: [Receiver] write error: Broken pipe (32)
rsync: [sender] change_dir "/tmp/homes/builder0/install/0" failed: No such file or directory (2)
rsync error: some files/attrs were not transferred (see previous errors) (code 23) at main.c(1863) [Receiver=3.2.7]
rsync: [Receiver] write error: Broken pipe (32)
rsync: [sender] change_dir "/tmp/homes/builder0/install/0" failed: No such file or directory (2)
rsync error: some files/attrs were not transferred (see previous errors) (code 23) at main.c(1863) [Receiver=3.2.7]
rsync: [Receiver] write error: Broken pipe (32)
rsync: [sender] change_dir "/tmp/homes/builder0/install/0" failed: No such file or directory (2)
rsync error: some files/attrs were not transferred (see previous errors) (code 23) at main.c(1863) [Receiver=3.2.7]
rsync: [Receiver] write error: Broken pipe (32)
rsync: [sender] change_dir "/tmp/homes/builder0/install/0" failed: No such file or directory (2)
rsync error: some files/attrs were not transferred (see previous errors) (code 23) at main.c(1863) [Receiver=3.2.7]
rsync: [Receiver] write error: Broken pipe (32)
rsync: [sender] change_dir "/tmp/homes/builder0/install/0" failed: No such file or directory (2)
rsync error: some files/attrs were not transferred (see previous errors) (code 23) at main.c(1863) [Receiver=3.2.7]
rsync: [Receiver] write error: Broken pipe (32)
rsync: [sender] change_dir "/tmp/homes/builder0/install/0" failed: No such file or directory (2)
rsync error: some files/attrs were not transferred (see previous errors) (code 23) at main.c(1863) [Receiver=3.2.7]
rsync: [Receiver] write error: Broken pipe (32)
rsync: [sender] change_dir "/tmp/homes/builder0/install/0" failed: No such file or directory (2)
rsync error: some files/attrs were not transferred (see previous errors) (code 23) at main.c(1863) [Receiver=3.2.7]
rsync: [Receiver] write error: Broken pipe (32)
rsync: [sender] change_dir "/tmp/homes/builder0/install/0" failed: No such file or directory (2)
rsync error: some files/attrs were not transferred (see previous errors) (code 23) at main.c(1863) [Receiver=3.2.7]
rsync: [Receiver] write error: Broken pipe (32)
rsync: [sender] change_dir "/tmp/homes/builder0/install/0" failed: No such file or directory (2)
rsync error: some files/attrs were not transferred (see previous errors) (code 23) at main.c(1863) [Receiver=3.2.7]
rsync: [Receiver] write error: Broken pipe (32)
rsync: [sender] change_dir "/tmp/homes/builder0/install/0" failed: No such file or directory (2)
rsync error: some files/attrs were not transferred (see previous errors) (code 23) at main.c(1863) [Receiver=3.2.7]
rsync: [Receiver] write error: Broken pipe (32)
rsync: [sender] change_dir "/tmp/homes/builder0/install/0" failed: No such file or directory (2)
rsync error: some files/attrs were not transferred (see previous errors) (code 23) at main.c(1863) [Receiver=3.2.7]
rsync: [Receiver] write error: Broken pipe (32)
rsync: [sender] change_dir "/tmp/homes/builder0/install/0" failed: No such file or directory (2)
rsync error: some files/attrs were not transferred (see previous errors) (code 23) at main.c(1863) [Receiver=3.2.7]
rsync: [Receiver] write error: Broken pipe (32)
rsync: [sender] change_dir "/tmp/homes/builder0/install/0" failed: No such file or directory (2)
rsync error: some files/attrs were not transferred (see previous errors) (code 23) at main.c(1863) [Receiver=3.2.7]
rsync: [Receiver] write error: Broken pipe (32)
rsync: [sender] change_dir "/tmp/homes/builder0/install/0" failed: No such file or directory (2)
rsync error: some files/attrs were not transferred (see previous errors) (code 23) at main.c(1863) [Receiver=3.2.7]
rsync: [Receiver] write error: Broken pipe (32)
rsync: [sender] change_dir "/tmp/homes/builder0/install/0" failed: No such file or directory (2)
rsync error: some files/attrs were not transferred (see previous errors) (code 23) at main.c(1863) [Receiver=3.2.7]
rsync: [Receiver] write error: Broken pipe (32)
rsync: [sender] change_dir "/tmp/homes/builder0/install/0" failed: No such file or directory (2)
rsync error: some files/attrs were not transferred (see previous errors) (code 23) at main.c(1863) [Receiver=3.2.7]
rsync: [Receiver] write error: Broken pipe (32)
rsync: [sender] change_dir "/tmp/homes/builder0/install/0" failed: No such file or directory (2)
rsync error: some files/attrs were not transferred (see previous errors) (code 23) at main.c(1863) [Receiver=3.2.7]
rsync: [Receiver] write error: Broken pipe (32)
rsync: [sender] change_dir "/tmp/homes/builder0/install/0" failed: No such file or directory (2)
rsync error: some files/attrs were not transferred (see previous errors) (code 23) at main.c(1863) [Receiver=3.2.7]
rsync: [Receiver] write error: Broken pipe (32)
rsync: [sender] change_dir "/tmp/homes/builder0/install/0" failed: No such file or directory (2)
rsync error: some files/attrs were not transferred (see previous errors) (code 23) at main.c(1863) [Receiver=3.2.7]
rsync: [Receiver] write error: Broken pipe (32)
rsync: [sender] change_dir "/tmp/homes/builder0/install/0" failed: No such file or directory (2)
rsync error: some files/attrs were not transferred (see previous errors) (code 23) at main.c(1863) [Receiver=3.2.7]
rsync: [Receiver] write error: Broken pipe (32)
rsync: [sender] change_dir "/tmp/homes/builder0/install/0" failed: No such file or directory (2)
rsync error: some files/attrs were not transferred (see previous errors) (code 23) at main.c(1863) [Receiver=3.2.7]
rsync: [Receiver] write error: Broken pipe (32)
rsync: [sender] change_dir "/tmp/homes/builder0/install/0" failed: No such file or directory (2)
rsync error: some files/attrs were not transferred (see previous errors) (code 23) at main.c(1863) [Receiver=3.2.7]
rsync: [Receiver] write error: Broken pipe (32)
rsync: [sender] change_dir "/tmp/homes/builder0/install/0" failed: No such file or directory (2)
rsync error: some files/attrs were not transferred (see previous errors) (code 23) at main.c(1863) [Receiver=3.2.7]
rsync: [Receiver] write error: Broken pipe (32)
rsync: [sender] change_dir "/tmp/homes/builder0/install/0" failed: No such file or directory (2)
rsync error: some files/attrs were not transferred (see previous errors) (code 23) at main.c(1863) [Receiver=3.2.7]
rsync: [Receiver] write error: Broken pipe (32)
rsync: [sender] change_dir "/tmp/homes/builder0/install/0" failed: No such file or directory (2)
rsync error: some files/attrs were not transferred (see previous errors) (code 23) at main.c(1863) [Receiver=3.2.7]
rsync: [Receiver] write error: Broken pipe (32)
rsync: [sender] change_dir "/tmp/homes/builder0/install/0" failed: No such file or directory (2)
rsync error: some files/attrs were not transferred (see previous errors) (code 23) at main.c(1863) [Receiver=3.2.7]
rsync: [Receiver] write error: Broken pipe (32)
rsync: [sender] change_dir "/tmp/homes/builder0/install/0" failed: No such file or directory (2)
rsync error: some files/attrs were not transferred (see previous errors) (code 23) at main.c(1863) [Receiver=3.2.7]
rsync: [Receiver] write error: Broken pipe (32)
rsync: [sender] change_dir "/tmp/homes/builder0/install/0" failed: No such file or directory (2)
rsync error: some files/attrs were not transferred (see previous errors) (code 23) at main.c(1863) [Receiver=3.2.7]
rsync: [Receiver] write error: Broken pipe (32)
rsync: [sender] change_dir "/tmp/homes/builder0/install/0" failed: No such file or directory (2)
rsync error: some files/attrs were not transferred (see previous errors) (code 23) at main.c(1863) [Receiver=3.2.7]
rsync: [Receiver] write error: Broken pipe (32)
rsync: [sender] change_dir "/tmp/homes/builder0/install/0" failed: No such file or directory (2)
rsync error: some files/attrs were not transferred (see previous errors) (code 23) at main.c(1863) [Receiver=3.2.7]
rsync: [Receiver] write error: Broken pipe (32)
rsync: [sender] change_dir "/tmp/homes/builder0/install/0" failed: No such file or directory (2)
rsync error: some files/attrs were not transferred (see previous errors) (code 23) at main.c(1863) [Receiver=3.2.7]
rsync: [Receiver] write error: Broken pipe (32)
rsync: [sender] change_dir "/tmp/homes/builder0/install/0" failed: No such file or directory (2)
rsync error: some files/attrs were not transferred (see previous errors) (code 23) at main.c(1863) [Receiver=3.2.7]
rsync: [Receiver] write error: Broken pipe (32)
rsync: [sender] change_dir "/tmp/homes/builder0/install/0" failed: No such file or directory (2)
rsync error: some files/attrs were not transferred (see previous errors) (code 23) at main.c(1863) [Receiver=3.2.7]
rsync: [Receiver] write error: Broken pipe (32)
rsync: [sender] change_dir "/tmp/homes/builder0/install/0" failed: No such file or directory (2)
rsync error: some files/attrs were not transferred (see previous errors) (code 23) at main.c(1863) [Receiver=3.2.7]
rsync: [Receiver] write error: Broken pipe (32)
rsync: [sender] change_dir "/tmp/homes/builder0/install/0" failed: No such file or directory (2)
rsync error: some files/attrs were not transferred (see previous errors) (code 23) at main.c(1863) [Receiver=3.2.7]
rsync: [Receiver] write error: Broken pipe (32)
rsync: [sender] change_dir "/tmp/homes/builder0/install/0" failed: No such file or directory (2)
rsync error: some files/attrs were not transferred (see previous errors) (code 23) at main.c(1863) [Receiver=3.2.7]
rsync: [Receiver] write error: Broken pipe (32)
rsync: [sender] change_dir "/tmp/homes/builder0/install/0" failed: No such file or directory (2)
rsync error: some files/attrs were not transferred (see previous errors) (code 23) at main.c(1863) [Receiver=3.2.7]
rsync: [Receiver] write error: Broken pipe (32)
rsync: [sender] change_dir "/tmp/homes/builder0/install/0" failed: No such file or directory (2)
rsync error: some files/attrs were not transferred (see previous errors) (code 23) at main.c(1863) [Receiver=3.2.7]
rsync: [Receiver] write error: Broken pipe (32)
rsync: [sender] change_dir "/tmp/homes/builder0/install/0" failed: No such file or directory (2)
rsync error: some files/attrs were not transferred (see previous errors) (code 23) at main.c(1863) [Receiver=3.2.7]
rsync: [Receiver] write error: Broken pipe (32)
rsync: [sender] change_dir "/tmp/homes/builder0/install/0" failed: No such file or directory (2)
rsync error: some files/attrs were not transferred (see previous errors) (code 23) at main.c(1863) [Receiver=3.2.7]
rsync: [Receiver] write error: Broken pipe (32)
rsync: [sender] change_dir "/tmp/homes/builder0/install/0" failed: No such file or directory (2)
rsync error: some files/attrs were not transferred (see previous errors) (code 23) at main.c(1863) [Receiver=3.2.7]
rsync: [Receiver] write error: Broken pipe (32)
rsync: [sender] change_dir "/tmp/homes/builder0/install/0" failed: No such file or directory (2)
rsync error: some files/attrs were not transferred (see previous errors) (code 23) at main.c(1863) [Receiver=3.2.7]
rsync: [Receiver] write error: Broken pipe (32)
rsync: [sender] change_dir "/tmp/homes/builder0/install/0" failed: No such file or directory (2)
rsync error: some files/attrs were not transferred (see previous errors) (code 23) at main.c(1863) [Receiver=3.2.7]
rsync: [Receiver] write error: Broken pipe (32)
rsync: [sender] change_dir "/tmp/homes/builder0/install/0" failed: No such file or directory (2)
rsync error: some files/attrs were not transferred (see previous errors) (code 23) at main.c(1863) [Receiver=3.2.7]
rsync: [Receiver] write error: Broken pipe (32)
rsync: [sender] change_dir "/tmp/homes/builder0/install/0" failed: No such file or directory (2)
rsync error: some files/attrs were not transferred (see previous errors) (code 23) at main.c(1863) [Receiver=3.2.7]
rsync: [Receiver] write error: Broken pipe (32)
rsync: [sender] change_dir "/tmp/homes/builder0/install/0" failed: No such file or directory (2)
rsync error: some files/attrs were not transferred (see previous errors) (code 23) at main.c(1863) [Receiver=3.2.7]
rsync: [Receiver] write error: Broken pipe (32)
rsync: [sender] change_dir "/tmp/homes/builder0/install/0" failed: No such file or directory (2)
rsync error: some files/attrs were not transferred (see previous errors) (code 23) at main.c(1863) [Receiver=3.2.7]
rsync: [Receiver] write error: Broken pipe (32)
rsync: [sender] change_dir "/tmp/homes/builder0/install/0" failed: No such file or directory (2)
rsync error: some files/attrs were not transferred (see previous errors) (code 23) at main.c(1863) [Receiver=3.2.7]
rsync: [Receiver] write error: Broken pipe (32)
rsync: [sender] change_dir "/tmp/homes/builder0/install/0" failed: No such file or directory (2)
rsync error: some files/attrs were not transferred (see previous errors) (code 23) at main.c(1863) [Receiver=3.2.7]
rsync: [Receiver] write error: Broken pipe (32)
rsync: [sender] change_dir "/tmp/homes/builder0/install/0" failed: No such file or directory (2)
rsync error: some files/attrs were not transferred (see previous errors) (code 23) at main.c(1863) [Receiver=3.2.7]
rsync: [Receiver] write error: Broken pipe (32)
rsync: [sender] change_dir "/tmp/homes/builder0/install/0" failed: No such file or directory (2)
rsync error: some files/attrs were not transferred (see previous errors) (code 23) at main.c(1863) [Receiver=3.2.7]
rsync: [Receiver] write error: Broken pipe (32)
rsync: [sender] change_dir "/tmp/homes/builder0/install/0" failed: No such file or directory (2)
rsync error: some files/attrs were not transferred (see previous errors) (code 23) at main.c(1863) [Receiver=3.2.7]
rsync: [Receiver] write error: Broken pipe (32)
rsync: [sender] change_dir "/tmp/homes/builder0/install/0" failed: No such file or directory (2)
rsync error: some files/attrs were not transferred (see previous errors) (code 23) at main.c(1863) [Receiver=3.2.7]
rsync: [Receiver] write error: Broken pipe (32)
rsync: [sender] change_dir "/tmp/homes/builder0/install/0" failed: No such file or directory (2)
rsync error: some files/attrs were not transferred (see previous errors) (code 23) at main.c(1863) [Receiver=3.2.7]
rsync: [Receiver] write error: Broken pipe (32)
rsync: [sender] change_dir "/tmp/homes/builder0/install/0" failed: No such file or directory (2)
rsync error: some files/attrs were not transferred (see previous errors) (code 23) at main.c(1863) [Receiver=3.2.7]
rsync: [Receiver] write error: Broken pipe (32)
rsync: [sender] change_dir "/tmp/homes/builder0/install/0" failed: No such file or directory (2)
rsync error: some files/attrs were not transferred (see previous errors) (code 23) at main.c(1863) [Receiver=3.2.7]
rsync: [Receiver] write error: Broken pipe (32)
rsync: [sender] change_dir "/tmp/homes/builder0/install/0" failed: No such file or directory (2)
rsync error: some files/attrs were not transferred (see previous errors) (code 23) at main.c(1863) [Receiver=3.2.7]
rsync: [Receiver] write error: Broken pipe (32)
rsync: [sender] change_dir "/tmp/homes/builder0/install/0" failed: No such file or directory (2)
rsync error: some files/attrs were not transferred (see previous errors) (code 23) at main.c(1863) [Receiver=3.2.7]
rsync: [Receiver] write error: Broken pipe (32)
rsync: [sender] change_dir "/tmp/homes/builder0/install/0" failed: No such file or directory (2)
rsync error: some files/attrs were not transferred (see previous errors) (code 23) at main.c(1863) [Receiver=3.2.7]
rsync: [Receiver] write error: Broken pipe (32)
rsync: [sender] change_dir "/tmp/homes/builder0/install/0" failed: No such file or directory (2)
rsync error: some files/attrs were not transferred (see previous errors) (code 23) at main.c(1863) [Receiver=3.2.7]
rsync: [Receiver] write error: Broken pipe (32)
rsync: [sender] change_dir "/tmp/homes/builder0/install/0" failed: No such file or directory (2)
rsync error: some files/attrs were not transferred (see previous errors) (code 23) at main.c(1863) [Receiver=3.2.7]
rsync: [Receiver] write error: Broken pipe (32)
rsync: [sender] change_dir "/tmp/homes/builder0/install/0" failed: No such file or directory (2)
rsync error: some files/attrs were not transferred (see previous errors) (code 23) at main.c(1863) [Receiver=3.2.7]
rsync: [Receiver] write error: Broken pipe (32)
rsync: [sender] change_dir "/tmp/homes/builder0/install/0" failed: No such file or directory (2)
rsync error: some files/attrs were not transferred (see previous errors) (code 23) at main.c(1863) [Receiver=3.2.7]
rsync: [Receiver] write error: Broken pipe (32)
rsync: [sender] change_dir "/tmp/homes/builder0/install/0" failed: No such file or directory (2)
rsync error: some files/attrs were not transferred (see previous errors) (code 23) at main.c(1863) [Receiver=3.2.7]
rsync: [Receiver] write error: Broken pipe (32)
rsync: [sender] change_dir "/tmp/homes/builder0/install/0" failed: No such file or directory (2)
rsync error: some files/attrs were not transferred (see previous errors) (code 23) at main.c(1863) [Receiver=3.2.7]
rsync: [Receiver] write error: Broken pipe (32)
rsync: [sender] change_dir "/tmp/homes/builder0/install/0" failed: No such file or directory (2)
rsync error: some files/attrs were not transferred (see previous errors) (code 23) at main.c(1863) [Receiver=3.2.7]
rsync: [Receiver] write error: Broken pipe (32)
rsync: [sender] change_dir "/tmp/homes/builder0/install/0" failed: No such file or directory (2)
rsync error: some files/attrs were not transferred (see previous errors) (code 23) at main.c(1863) [Receiver=3.2.7]
rsync: [Receiver] write error: Broken pipe (32)
rsync: [sender] change_dir "/tmp/homes/builder0/install/0" failed: No such file or directory (2)
rsync error: some files/attrs were not transferred (see previous errors) (code 23) at main.c(1863) [Receiver=3.2.7]
rsync: [Receiver] write error: Broken pipe (32)
rsync: [sender] change_dir "/tmp/homes/builder0/install/0" failed: No such file or directory (2)
rsync error: some files/attrs were not transferred (see previous errors) (code 23) at main.c(1863) [Receiver=3.2.7]
rsync: [Receiver] write error: Broken pipe (32)
rsync: [sender] change_dir "/tmp/homes/builder0/install/0" failed: No such file or directory (2)
rsync error: some files/attrs were not transferred (see previous errors) (code 23) at main.c(1863) [Receiver=3.2.7]
rsync: [Receiver] write error: Broken pipe (32)
rsync: [sender] change_dir "/tmp/homes/builder0/install/0" failed: No such file or directory (2)
rsync error: some files/attrs were not transferred (see previous errors) (code 23) at main.c(1863) [Receiver=3.2.7]
rsync: [Receiver] write error: Broken pipe (32)
rsync: [sender] change_dir "/tmp/homes/builder0/install/0" failed: No such file or directory (2)
rsync error: some files/attrs were not transferred (see previous errors) (code 23) at main.c(1863) [Receiver=3.2.7]
rsync: [Receiver] write error: Broken pipe (32)
rsync: [sender] change_dir "/tmp/homes/builder0/install/0" failed: No such file or directory (2)
rsync error: some files/attrs were not transferred (see previous errors) (code 23) at main.c(1863) [Receiver=3.2.7]
rsync: [Receiver] write error: Broken pipe (32)
rsync: [sender] change_dir "/tmp/homes/builder0/install/0" failed: No such file or directory (2)
rsync error: some files/attrs were not transferred (see previous errors) (code 23) at main.c(1863) [Receiver=3.2.7]
rsync: [Receiver] write error: Broken pipe (32)
rsync: [sender] change_dir "/tmp/homes/builder0/install/0" failed: No such file or directory (2)
rsync error: some files/attrs were not transferred (see previous errors) (code 23) at main.c(1863) [Receiver=3.2.7]
rsync: [Receiver] write error: Broken pipe (32)
rsync: [sender] change_dir "/tmp/homes/builder0/install/0" failed: No such file or directory (2)
rsync error: some files/attrs were not transferred (see previous errors) (code 23) at main.c(1863) [Receiver=3.2.7]
rsync: [Receiver] write error: Broken pipe (32)
rsync: [sender] change_dir "/tmp/homes/builder0/install/0" failed: No such file or directory (2)
rsync error: some files/attrs were not transferred (see previous errors) (code 23) at main.c(1863) [Receiver=3.2.7]
rsync: [Receiver] write error: Broken pipe (32)
rsync: [sender] change_dir "/tmp/homes/builder0/install/0" failed: No such file or directory (2)
rsync error: some files/attrs were not transferred (see previous errors) (code 23) at main.c(1863) [Receiver=3.2.7]
rsync: [Receiver] write error: Broken pipe (32)
rsync: [sender] change_dir "/tmp/homes/builder0/install/0" failed: No such file or directory (2)
rsync error: some files/attrs were not transferred (see previous errors) (code 23) at main.c(1863) [Receiver=3.2.7]
rsync: [Receiver] write error: Broken pipe (32)
rsync: [sender] change_dir "/tmp/homes/builder0/install/0" failed: No such file or directory (2)
rsync error: some files/attrs were not transferred (see previous errors) (code 23) at main.c(1863) [Receiver=3.2.7]
rsync: [Receiver] write error: Broken pipe (32)
rsync: [sender] change_dir "/tmp/homes/builder0/install/0" failed: No such file or directory (2)
rsync error: some files/attrs were not transferred (see previous errors) (code 23) at main.c(1863) [Receiver=3.2.7]
rsync: [Receiver] write error: Broken pipe (32)
rsync: [sender] change_dir "/tmp/homes/builder0/install/0" failed: No such file or directory (2)
rsync error: some files/attrs were not transferred (see previous errors) (code 23) at main.c(1863) [Receiver=3.2.7]
rsync: [Receiver] write error: Broken pipe (32)
rsync: [sender] change_dir "/tmp/homes/builder0/install/0" failed: No such file or directory (2)
rsync error: some files/attrs were not transferred (see previous errors) (code 23) at main.c(1863) [Receiver=3.2.7]
rsync: [Receiver] write error: Broken pipe (32)
rsync: [sender] change_dir "/tmp/homes/builder0/install/0" failed: No such file or directory (2)
rsync error: some files/attrs were not transferred (see previous errors) (code 23) at main.c(1863) [Receiver=3.2.7]
rsync: [Receiver] write error: Broken pipe (32)
rsync: [sender] change_dir "/tmp/homes/builder0/install/0" failed: No such file or directory (2)
rsync error: some files/attrs were not transferred (see previous errors) (code 23) at main.c(1863) [Receiver=3.2.7]
rsync: [Receiver] write error: Broken pipe (32)
rsync: [sender] change_dir "/tmp/homes/builder0/install/0" failed: No such file or directory (2)
rsync error: some files/attrs were not transferred (see previous errors) (code 23) at main.c(1863) [Receiver=3.2.7]
rsync: [Receiver] write error: Broken pipe (32)
rsync: [sender] change_dir "/tmp/homes/builder0/install/0" failed: No such file or directory (2)
rsync error: some files/attrs were not transferred (see previous errors) (code 23) at main.c(1863) [Receiver=3.2.7]
rsync: [Receiver] write error: Broken pipe (32)
rsync: [sender] change_dir "/tmp/homes/builder0/install/0" failed: No such file or directory (2)
rsync error: some files/attrs were not transferred (see previous errors) (code 23) at main.c(1863) [Receiver=3.2.7]
rsync: [Receiver] write error: Broken pipe (32)
rsync: [sender] change_dir "/tmp/homes/builder0/install/0" failed: No such file or directory (2)
rsync error: some files/attrs were not transferred (see previous errors) (code 23) at main.c(1863) [Receiver=3.2.7]
rsync: [Receiver] write error: Broken pipe (32)
rsync: [sender] change_dir "/tmp/homes/builder0/install/0" failed: No such file or directory (2)
rsync error: some files/attrs were not transferred (see previous errors) (code 23) at main.c(1863) [Receiver=3.2.7]
rsync: [Receiver] write error: Broken pipe (32)
rsync: [sender] change_dir "/tmp/homes/builder0/install/0" failed: No such file or directory (2)
rsync error: some files/attrs were not transferred (see previous errors) (code 23) at main.c(1863) [Receiver=3.2.7]
rsync: [Receiver] write error: Broken pipe (32)
rsync: [sender] change_dir "/tmp/homes/builder0/install/0" failed: No such file or directory (2)
rsync error: some files/attrs were not transferred (see previous errors) (code 23) at main.c(1863) [Receiver=3.2.7]
rsync: [Receiver] write error: Broken pipe (32)
rsync: [sender] change_dir "/tmp/homes/builder0/install/0" failed: No such file or directory (2)
rsync error: some files/attrs were not transferred (see previous errors) (code 23) at main.c(1863) [Receiver=3.2.7]
rsync: [Receiver] write error: Broken pipe (32)
rsync: [sender] change_dir "/tmp/homes/builder0/install/0" failed: No such file or directory (2)
rsync error: some files/attrs were not transferred (see previous errors) (code 23) at main.c(1863) [Receiver=3.2.7]
rsync: [Receiver] write error: Broken pipe (32)
rsync: [sender] change_dir "/tmp/homes/builder0/install/0" failed: No such file or directory (2)
rsync error: some files/attrs were not transferred (see previous errors) (code 23) at main.c(1863) [Receiver=3.2.7]
rsync: [Receiver] write error: Broken pipe (32)
rsync: [sender] change_dir "/tmp/homes/builder0/install/0" failed: No such file or directory (2)
rsync error: some files/attrs were not transferred (see previous errors) (code 23) at main.c(1863) [Receiver=3.2.7]
rsync: [Receiver] write error: Broken pipe (32)
rsync: [sender] change_dir "/tmp/homes/builder0/install/0" failed: No such file or directory (2)
rsync error: some files/attrs were not transferred (see previous errors) (code 23) at main.c(1863) [Receiver=3.2.7]
rsync: [Receiver] write error: Broken pipe (32)
rsync: [sender] change_dir "/tmp/homes/builder0/install/0" failed: No such file or directory (2)
rsync error: some files/attrs were not transferred (see previous errors) (code 23) at main.c(1863) [Receiver=3.2.7]
rsync: [Receiver] write error: Broken pipe (32)
rsync: [sender] change_dir "/tmp/homes/builder0/install/0" failed: No such file or directory (2)
rsync error: some files/attrs were not transferred (see previous errors) (code 23) at main.c(1863) [Receiver=3.2.7]
rsync: [Receiver] write error: Broken pipe (32)
rsync: [sender] change_dir "/tmp/homes/builder0/install/0" failed: No such file or directory (2)
rsync error: some files/attrs were not transferred (see previous errors) (code 23) at main.c(1863) [Receiver=3.2.7]
rsync: [Receiver] write error: Broken pipe (32)
rsync: [sender] change_dir "/tmp/homes/builder0/install/0" failed: No such file or directory (2)
rsync error: some files/attrs were not transferred (see previous errors) (code 23) at main.c(1863) [Receiver=3.2.7]
rsync: [Receiver] write error: Broken pipe (32)
rsync: [sender] change_dir "/tmp/homes/builder0/install/0" failed: No such file or directory (2)
rsync error: some files/attrs were not transferred (see previous errors) (code 23) at main.c(1863) [Receiver=3.2.7]
rsync: [Receiver] write error: Broken pipe (32)
rsync: [sender] change_dir "/tmp/homes/builder0/install/0" failed: No such file or directory (2)
rsync error: some files/attrs were not transferred (see previous errors) (code 23) at main.c(1863) [Receiver=3.2.7]
rsync: [Receiver] write error: Broken pipe (32)
rsync: [sender] change_dir "/tmp/homes/builder0/install/0" failed: No such file or directory (2)
rsync error: some files/attrs were not transferred (see previous errors) (code 23) at main.c(1863) [Receiver=3.2.7]
rsync: [Receiver] write error: Broken pipe (32)
rsync: [sender] change_dir "/tmp/homes/builder0/install/0" failed: No such file or directory (2)
rsync error: some files/attrs were not transferred (see previous errors) (code 23) at main.c(1863) [Receiver=3.2.7]
rsync: [Receiver] write error: Broken pipe (32)
rsync: [sender] change_dir "/tmp/homes/builder0/install/0" failed: No such file or directory (2)
rsync error: some files/attrs were not transferred (see previous errors) (code 23) at main.c(1863) [Receiver=3.2.7]
rsync: [Receiver] write error: Broken pipe (32)
rsync: [sender] change_dir "/tmp/homes/builder0/install/0" failed: No such file or directory (2)
rsync error: some files/attrs were not transferred (see previous errors) (code 23) at main.c(1863) [Receiver=3.2.7]
rsync: [Receiver] write error: Broken pipe (32)
rsync: [sender] change_dir "/tmp/homes/builder0/install/0" failed: No such file or directory (2)
rsync error: some files/attrs were not transferred (see previous errors) (code 23) at main.c(1863) [Receiver=3.2.7]
rsync: [Receiver] write error: Broken pipe (32)
rsync: [sender] change_dir "/tmp/homes/builder0/install/0" failed: No such file or directory (2)
rsync error: some files/attrs were not transferred (see previous errors) (code 23) at main.c(1863) [Receiver=3.2.7]
rsync: [Receiver] write error: Broken pipe (32)
rsync: [sender] change_dir "/tmp/homes/builder0/install/0" failed: No such file or directory (2)
rsync error: some files/attrs were not transferred (see previous errors) (code 23) at main.c(1863) [Receiver=3.2.7]
rsync: [Receiver] write error: Broken pipe (32)
rsync: [sender] change_dir "/tmp/homes/builder0/install/0" failed: No such file or directory (2)
rsync error: some files/attrs were not transferred (see previous errors) (code 23) at main.c(1863) [Receiver=3.2.7]
rsync: [Receiver] write error: Broken pipe (32)
rsync: [sender] change_dir "/tmp/homes/builder0/install/0" failed: No such file or directory (2)
rsync error: some files/attrs were not transferred (see previous errors) (code 23) at main.c(1863) [Receiver=3.2.7]
rsync: [Receiver] write error: Broken pipe (32)
rsync: [sender] change_dir "/tmp/homes/builder0/install/0" failed: No such file or directory (2)
rsync error: some files/attrs were not transferred (see previous errors) (code 23) at main.c(1863) [Receiver=3.2.7]
rsync: [Receiver] write error: Broken pipe (32)
rsync: [sender] change_dir "/tmp/homes/builder0/install/0" failed: No such file or directory (2)
rsync error: some files/attrs were not transferred (see previous errors) (code 23) at main.c(1863) [Receiver=3.2.7]
rsync: [Receiver] write error: Broken pipe (32)
rsync: [sender] change_dir "/tmp/homes/builder0/install/0" failed: No such file or directory (2)
rsync error: some files/attrs were not transferred (see previous errors) (code 23) at main.c(1863) [Receiver=3.2.7]
rsync: [Receiver] write error: Broken pipe (32)
rsync: [sender] change_dir "/tmp/homes/builder0/install/0" failed: No such file or directory (2)
rsync error: some files/attrs were not transferred (see previous errors) (code 23) at main.c(1863) [Receiver=3.2.7]
rsync: [Receiver] write error: Broken pipe (32)
rsync: [sender] change_dir "/tmp/homes/builder0/install/0" failed: No such file or directory (2)
rsync error: some files/attrs were not transferred (see previous errors) (code 23) at main.c(1863) [Receiver=3.2.7]
rsync: [Receiver] write error: Broken pipe (32)
rsync: [sender] change_dir "/tmp/homes/builder0/install/0" failed: No such file or directory (2)
rsync error: some files/attrs were not transferred (see previous errors) (code 23) at main.c(1863) [Receiver=3.2.7]
rsync: [Receiver] write error: Broken pipe (32)
rsync: [sender] change_dir "/tmp/homes/builder0/install/0" failed: No such file or directory (2)
rsync error: some files/attrs were not transferred (see previous errors) (code 23) at main.c(1863) [Receiver=3.2.7]
rsync: [Receiver] write error: Broken pipe (32)
rsync: [sender] change_dir "/tmp/homes/builder0/install/0" failed: No such file or directory (2)
rsync error: some files/attrs were not transferred (see previous errors) (code 23) at main.c(1863) [Receiver=3.2.7]
rsync: [Receiver] write error: Broken pipe (32)
rsync: [sender] change_dir "/tmp/homes/builder0/install/0" failed: No such file or directory (2)
rsync error: some files/attrs were not transferred (see previous errors) (code 23) at main.c(1863) [Receiver=3.2.7]
rsync: [Receiver] write error: Broken pipe (32)
rsync: [sender] change_dir "/tmp/homes/builder0/install/0" failed: No such file or directory (2)
rsync error: some files/attrs were not transferred (see previous errors) (code 23) at main.c(1863) [Receiver=3.2.7]
rsync: [Receiver] write error: Broken pipe (32)
rsync: [sender] change_dir "/tmp/homes/builder0/install/0" failed: No such file or directory (2)
rsync error: some files/attrs were not transferred (see previous errors) (code 23) at main.c(1863) [Receiver=3.2.7]
rsync: [Receiver] write error: Broken pipe (32)
rsync: [sender] change_dir "/tmp/homes/builder0/install/0" failed: No such file or directory (2)
rsync error: some files/attrs were not transferred (see previous errors) (code 23) at main.c(1863) [Receiver=3.2.7]
rsync: [Receiver] write error: Broken pipe (32)
rsync: [sender] change_dir "/tmp/homes/builder0/install/0" failed: No such file or directory (2)
rsync error: some files/attrs were not transferred (see previous errors) (code 23) at main.c(1863) [Receiver=3.2.7]
rsync: [Receiver] write error: Broken pipe (32)
rsync: [sender] change_dir "/tmp/homes/builder0/install/0" failed: No such file or directory (2)
rsync error: some files/attrs were not transferred (see previous errors) (code 23) at main.c(1863) [Receiver=3.2.7]
rsync: [Receiver] write error: Broken pipe (32)
rsync: [sender] change_dir "/tmp/homes/builder0/install/0" failed: No such file or directory (2)
rsync error: some files/attrs were not transferred (see previous errors) (code 23) at main.c(1863) [Receiver=3.2.7]
rsync: [Receiver] write error: Broken pipe (32)
rsync: [sender] change_dir "/tmp/homes/builder0/install/0" failed: No such file or directory (2)
rsync error: some files/attrs were not transferred (see previous errors) (code 23) at main.c(1863) [Receiver=3.2.7]
rsync: [Receiver] write error: Broken pipe (32)
rsync: [sender] change_dir "/tmp/homes/builder0/install/0" failed: No such file or directory (2)
rsync error: some files/attrs were not transferred (see previous errors) (code 23) at main.c(1863) [Receiver=3.2.7]
rsync: [Receiver] write error: Broken pipe (32)
rsync: [sender] change_dir "/tmp/homes/builder0/install/0" failed: No such file or directory (2)
rsync error: some files/attrs were not transferred (see previous errors) (code 23) at main.c(1863) [Receiver=3.2.7]
rsync: [Receiver] write error: Broken pipe (32)
rsync: [sender] change_dir "/tmp/homes/builder0/install/0" failed: No such file or directory (2)
rsync error: some files/attrs were not transferred (see previous errors) (code 23) at main.c(1863) [Receiver=3.2.7]
rsync: [Receiver] write error: Broken pipe (32)
rsync: [sender] change_dir "/tmp/homes/builder0/install/0" failed: No such file or directory (2)
rsync error: some files/attrs were not transferred (see previous errors) (code 23) at main.c(1863) [Receiver=3.2.7]
rsync: [Receiver] write error: Broken pipe (32)
rsync: [sender] change_dir "/tmp/homes/builder0/install/0" failed: No such file or directory (2)
rsync error: some files/attrs were not transferred (see previous errors) (code 23) at main.c(1863) [Receiver=3.2.7]
rsync: [Receiver] write error: Broken pipe (32)
rsync: [sender] change_dir "/tmp/homes/builder0/install/0" failed: No such file or directory (2)
rsync error: some files/attrs were not transferred (see previous errors) (code 23) at main.c(1863) [Receiver=3.2.7]
rsync: [Receiver] write error: Broken pipe (32)
rsync: [sender] change_dir "/tmp/homes/builder0/install/0" failed: No such file or directory (2)
rsync error: some files/attrs were not transferred (see previous errors) (code 23) at main.c(1863) [Receiver=3.2.7]
rsync: [Receiver] write error: Broken pipe (32)
rsync: [sender] change_dir "/tmp/homes/builder0/install/0" failed: No such file or directory (2)
rsync error: some files/attrs were not transferred (see previous errors) (code 23) at main.c(1863) [Receiver=3.2.7]
rsync: [Receiver] write error: Broken pipe (32)
rsync: [sender] change_dir "/tmp/homes/builder0/install/0" failed: No such file or directory (2)
rsync error: some files/attrs were not transferred (see previous errors) (code 23) at main.c(1863) [Receiver=3.2.7]
rsync: [Receiver] write error: Broken pipe (32)
rsync: [sender] change_dir "/tmp/homes/builder0/install/0" failed: No such file or directory (2)
rsync error: some files/attrs were not transferred (see previous errors) (code 23) at main.c(1863) [Receiver=3.2.7]
rsync: [Receiver] write error: Broken pipe (32)
rsync: [sender] change_dir "/tmp/homes/builder0/install/0" failed: No such file or directory (2)
rsync error: some files/attrs were not transferred (see previous errors) (code 23) at main.c(1863) [Receiver=3.2.7]
rsync: [Receiver] write error: Broken pipe (32)
rsync: [sender] change_dir "/tmp/homes/builder0/install/0" failed: No such file or directory (2)
rsync error: some files/attrs were not transferred (see previous errors) (code 23) at main.c(1863) [Receiver=3.2.7]
rsync: [Receiver] write error: Broken pipe (32)
rsync: [sender] change_dir "/tmp/homes/builder0/install/0" failed: No such file or directory (2)
rsync error: some files/attrs were not transferred (see previous errors) (code 23) at main.c(1863) [Receiver=3.2.7]
rsync: [Receiver] write error: Broken pipe (32)
rsync: [sender] change_dir "/tmp/homes/builder0/install/0" failed: No such file or directory (2)
rsync error: some files/attrs were not transferred (see previous errors) (code 23) at main.c(1863) [Receiver=3.2.7]
rsync: [Receiver] write error: Broken pipe (32)
rsync: [sender] change_dir "/tmp/homes/builder0/install/0" failed: No such file or directory (2)
rsync error: some files/attrs were not transferred (see previous errors) (code 23) at main.c(1863) [Receiver=3.2.7]
rsync: [Receiver] write error: Broken pipe (32)
rsync: [sender] change_dir "/tmp/homes/builder0/install/0" failed: No such file or directory (2)
rsync error: some files/attrs were not transferred (see previous errors) (code 23) at main.c(1863) [Receiver=3.2.7]
rsync: [Receiver] write error: Broken pipe (32)
rsync: [sender] change_dir "/tmp/homes/builder0/install/0" failed: No such file or directory (2)
rsync error: some files/attrs were not transferred (see previous errors) (code 23) at main.c(1863) [Receiver=3.2.7]
rsync: [Receiver] write error: Broken pipe (32)
rsync: [sender] change_dir "/tmp/homes/builder0/install/0" failed: No such file or directory (2)
rsync error: some files/attrs were not transferred (see previous errors) (code 23) at main.c(1863) [Receiver=3.2.7]
rsync: [Receiver] write error: Broken pipe (32)
rsync: [sender] change_dir "/tmp/homes/builder0/install/0" failed: No such file or directory (2)
rsync error: some files/attrs were not transferred (see previous errors) (code 23) at main.c(1863) [Receiver=3.2.7]
rsync: [Receiver] write error: Broken pipe (32)
rsync: [sender] change_dir "/tmp/homes/builder0/install/0" failed: No such file or directory (2)
rsync error: some files/attrs were not transferred (see previous errors) (code 23) at main.c(1863) [Receiver=3.2.7]
rsync: [Receiver] write error: Broken pipe (32)
rsync: [sender] change_dir "/tmp/homes/builder0/install/0" failed: No such file or directory (2)
rsync error: some files/attrs were not transferred (see previous errors) (code 23) at main.c(1863) [Receiver=3.2.7]
rsync: [Receiver] write error: Broken pipe (32)
rsync: [sender] change_dir "/tmp/homes/builder0/install/0" failed: No such file or directory (2)
rsync error: some files/attrs were not transferred (see previous errors) (code 23) at main.c(1863) [Receiver=3.2.7]
rsync: [Receiver] write error: Broken pipe (32)
rsync: [sender] change_dir "/tmp/homes/builder0/install/0" failed: No such file or directory (2)
rsync error: some files/attrs were not transferred (see previous errors) (code 23) at main.c(1863) [Receiver=3.2.7]
rsync: [Receiver] write error: Broken pipe (32)
rsync: [sender] change_dir "/tmp/homes/builder0/install/0" failed: No such file or directory (2)
rsync error: some files/attrs were not transferred (see previous errors) (code 23) at main.c(1863) [Receiver=3.2.7]
rsync: [Receiver] write error: Broken pipe (32)
rsync: [sender] change_dir "/tmp/homes/builder0/install/0" failed: No such file or directory (2)
rsync error: some files/attrs were not transferred (see previous errors) (code 23) at main.c(1863) [Receiver=3.2.7]
rsync: [Receiver] write error: Broken pipe (32)
rsync: [sender] change_dir "/tmp/homes/builder0/install/0" failed: No such file or directory (2)
rsync error: some files/attrs were not transferred (see previous errors) (code 23) at main.c(1863) [Receiver=3.2.7]
rsync: [Receiver] write error: Broken pipe (32)
rsync: [sender] change_dir "/tmp/homes/builder0/install/0" failed: No such file or directory (2)
rsync error: some files/attrs were not transferred (see previous errors) (code 23) at main.c(1863) [Receiver=3.2.7]
rsync: [Receiver] write error: Broken pipe (32)
rsync: [sender] change_dir "/tmp/homes/builder0/install/0" failed: No such file or directory (2)
rsync error: some files/attrs were not transferred (see previous errors) (code 23) at main.c(1863) [Receiver=3.2.7]
rsync: [Receiver] write error: Broken pipe (32)
rsync: [sender] change_dir "/tmp/homes/builder0/install/0" failed: No such file or directory (2)
rsync error: some files/attrs were not transferred (see previous errors) (code 23) at main.c(1863) [Receiver=3.2.7]
rsync: [Receiver] write error: Broken pipe (32)
rsync: [sender] change_dir "/tmp/homes/builder0/install/0" failed: No such file or directory (2)
rsync error: some files/attrs were not transferred (see previous errors) (code 23) at main.c(1863) [Receiver=3.2.7]
rsync: [Receiver] write error: Broken pipe (32)
rsync: [sender] change_dir "/tmp/homes/builder0/install/0" failed: No such file or directory (2)
rsync error: some files/attrs were not transferred (see previous errors) (code 23) at main.c(1863) [Receiver=3.2.7]
rsync: [Receiver] write error: Broken pipe (32)
rsync: [sender] change_dir "/tmp/homes/builder0/install/0" failed: No such file or directory (2)
rsync error: some files/attrs were not transferred (see previous errors) (code 23) at main.c(1863) [Receiver=3.2.7]
rsync: [Receiver] write error: Broken pipe (32)
rsync: [sender] change_dir "/tmp/homes/builder0/install/0" failed: No such file or directory (2)
rsync error: some files/attrs were not transferred (see previous errors) (code 23) at main.c(1863) [Receiver=3.2.7]
rsync: [Receiver] write error: Broken pipe (32)
rsync: [sender] change_dir "/tmp/homes/builder0/install/0" failed: No such file or directory (2)
rsync error: some files/attrs were not transferred (see previous errors) (code 23) at main.c(1863) [Receiver=3.2.7]
rsync: [Receiver] write error: Broken pipe (32)
rsync: [sender] change_dir "/tmp/homes/builder0/install/0" failed: No such file or directory (2)
rsync error: some files/attrs were not transferred (see previous errors) (code 23) at main.c(1863) [Receiver=3.2.7]
rsync: [Receiver] write error: Broken pipe (32)
gb-x-rsync-loop: all attempts failed
2026-Jul-13 17:09:22 :: [riscv64] install check FAILED for: kontainer
2026-Jul-13 17:09:22 :: [riscv64] install check FAILED
2026-Jul-13 17:09:22 :: task #132606 for sisyphus_riscv64 FAILED


More information about the Riscv-reports mailing list