[riscv-reports] [#132605] sisyphus_riscv64 FAILED srpm=akonadi-calendar-25.12.3-alt2.src.rpm

Girar sisyphus_riscv64 awaiter recycler noreply at basealt.ru
Mon Jul 13 19:43:36 MSK 2026


http://web.build.srt.basealt.ru/tasks/132605/logs/events.1.1.log

2026-Jul-13 16:42:18 :: shared task #132605 for sisyphus_riscv64 started by recycler:
2026-Jul-13 16:42:18 :: message: sync
#100 build akonadi-calendar-25.12.3-alt2.src.rpm
2026-Jul-13 16:42:29 :: [riscv64] #100 akonadi-calendar-25.12.3-alt2.src.rpm: build start
2026-Jul-13 16:43:36 :: [riscv64] #100 akonadi-calendar-25.12.3-alt2.src.rpm: build SKIPPED
2026-Jul-13 16:43:36 :: #100: akonadi-calendar-25.12.3-alt2.src.rpm: no source package
2026-Jul-13 16:43:36 :: build check FAILED for: #100 
2026-Jul-13 16:43:36 :: task #132605 for sisyphus_riscv64 FAILED


More information about the Riscv-reports mailing list