[riscv-reports] [#132568] sisyphus_riscv64 FAILED srpm=rtabmap-0.23.8-alt1.src.rpm
Girar sisyphus_riscv64 awaiter recycler
noreply at basealt.ru
Mon Jul 13 16:19:32 MSK 2026
http://web.build.srt.basealt.ru/tasks/132568/logs/events.1.1.log
2026-Jul-13 13:18:18 :: shared task #132568 for sisyphus_riscv64 started by recycler:
2026-Jul-13 13:18:18 :: message: sync
#100 build rtabmap-0.23.8-alt1.src.rpm
2026-Jul-13 13:18:23 :: [riscv64] #100 rtabmap-0.23.8-alt1.src.rpm: build start
2026-Jul-13 13:19:31 :: [riscv64] #100 rtabmap-0.23.8-alt1.src.rpm: build SKIPPED
2026-Jul-13 13:19:31 :: #100: rtabmap-0.23.8-alt1.src.rpm: no source package
2026-Jul-13 13:19:32 :: build check FAILED for: #100
2026-Jul-13 13:19:32 :: task #132568 for sisyphus_riscv64 FAILED
More information about the Riscv-reports
mailing list