[riscv-reports] [#132400] sisyphus_riscv64 FAILED (try 2) srpm=telegram-desktop-6.9.3-alt2.src.rpm

Girar sisyphus_riscv64 awaiter recycler noreply at basealt.ru
Mon Jul 13 15:22:54 MSK 2026


http://web.build.srt.basealt.ru/tasks/132400/logs/events.2.1.log

subtask  name              riscv64
   #100  telegram-desktop   failed

2026-Jul-13 08:15:04 :: shared task #132400 for sisyphus_riscv64 resumed by recycler:
2026-Jul-13 08:15:04 :: message: sync
#100 build telegram-desktop-6.9.3-alt2.src.rpm
2026-Jul-13 08:15:07 :: [riscv64] #100 telegram-desktop-6.9.3-alt2.src.rpm: build start
[riscv64] /usr/bin/c++ -pipe -frecord-gcc-switches -Wall -g0 -O2  -fpermissive -DNDEBUG -Wno-strict-aliasing -Wno-unused-variable -Wno-sign-compare -Wno-switch -fstack-protector-all -fstack-clash-protection -D_GLIBCXX_ASSERTIONS -O2 -DNDEBUG -Wno-alloc-size-larger-than -Wno-free-nonheap-object -Wno-stringop-overflow -Wno-stringop-overread -Wno-odr -Wno-inline -pthread -Wl,--as-needed -Wl,--dependency-file=CMakeFiles/Telegram.dir/link.d @CMakeFiles/Telegram.dir/objects1.rsp -o ../bin/Telegram  ../cmake/external/qt/qt_static_plugins/kimageformats/CMakeFiles/external_qt_static_plugins_kimageformats_init.dir/init.cpp.o ../cmake/external/qt/qt_static_plugins/nimf/CMakeFiles/external_qt_static_plugins_nimf_init.dir/init.cpp.o ../cmake/external/qt/qt_static_plugins/fcitx5/CMakeFiles/external_qt_static_plugins_fcitx5_init.dir/init.cpp.o ../cmake/external/qt/qt_static_plugins/hime/CMakeFiles/external_qt_static_plugins_hime_init.dir/init.cpp.o liblib_tgcalls.a lib_base/liblib_base.a lib_ui/lib
 lib_ui.a lib_spellcheck/liblib_spellcheck.a lib_webview/liblib_webview.a liblib_tgcalls.a /usr/lib64/librnnoise.so /usr/lib64/libopenal.so.1.25.2 /usr/lib64/librlottie.so.3.0.0 -Wl,--no-undefined /usr/lib64/libavfilter.so /usr/lib64/libtg_owt.a /usr/lib64/libpipewire-0.3.so /usr/lib64/libavcodec.so /usr/lib64/libavformat.so /usr/lib64/libavutil.so /usr/lib64/libswresample.so /usr/lib64/libswscale.so /usr/lib64/libopus.so /usr/lib64/libopenh264.so /usr/lib64/libssl.so /usr/lib64/libvpx.so /usr/lib64/libm.so /usr/lib64/libcrc32c.so.1.1.0 -lyuv /usr/lib64/libabsl_flags_parse.so.2605.0.0 /usr/lib64/libabsl_flags_usage.so.2605.0.0 /usr/lib64/libabsl_flags_usage_internal.so.2605.0.0 /usr/lib64/libabsl_flags_internal.so.2605.0.0 /usr/lib64/libabsl_flags_marshalling.so.2605.0.0 /usr/lib64/libabsl_flags_reflection.so.2605.0.0 /usr/lib64/libabsl_raw_hash_set.so.2605.0.0 /usr/lib64/libabsl_cord.so.2605.0.0 /usr/lib64/libabsl_cordz_info.so.2605.0.0 /usr/lib64/libabsl_cord_internal.so.2605.0.0 /
 usr/lib64/libabsl_cordz_functions.so.2605.0.0 /usr/lib64/libabsl_cordz_handle.so.2605.0.0 /usr/lib64/libabsl_crc_cord_state.so.2605.0.0 /usr/lib64/libabsl_crc32c.so.2605.0.0 /usr/lib64/libabsl_str_format_internal.so.2605.0.0 /usr/lib64/libabsl_crc_internal.so.2605.0.0 /usr/lib64/libabsl_crc_cpu_detect.so.2605.0.0 /usr/lib64/libabsl_hash.so.2605.0.0 /usr/lib64/libabsl_city.so.2605.0.0 /usr/lib64/libabsl_hashtablez_sampler.so.2605.0.0 /usr/lib64/libabsl_exponential_biased.so.2605.0.0 /usr/lib64/libabsl_flags_config.so.2605.0.0 /usr/lib64/libabsl_flags_private_handle_accessor.so.2605.0.0 /usr/lib64/libabsl_flags_commandlineflag.so.2605.0.0 /usr/lib64/libabsl_flags_commandlineflag_internal.so.2605.0.0 /usr/lib64/libabsl_flags_program_name.so.2605.0.0 /usr/lib64/libabsl_synchronization.so.2605.0.0 /usr/lib64/libabsl_graphcycles_internal.so.2605.0.0 /usr/lib64/libabsl_kernel_timeout_internal.so.2605.0.0 /usr/lib64/libabsl_stacktrace.so.2605.0.0 /usr/lib64/libabsl_symbolize.so.2605.0.0 /us
 r/lib64/libabsl_malloc_internal.so.2605.0.0 /usr/lib64/libabsl_debugging_internal.so.2605.0.0 /usr/lib64/libabsl_demangle_internal.so.2605.0.0 /usr/lib64/libabsl_demangle_rust.so.2605.0.0 /usr/lib64/libabsl_decode_rust_punycode.so.2605.0.0 /usr/lib64/libabsl_utf8_for_code_point.so.2605.0.0 /usr/lib64/libabsl_time.so.2605.0.0 /usr/lib64/libabsl_strings.so.2605.0.0 /usr/lib64/libabsl_strings_internal.so.2605.0.0 /usr/lib64/libabsl_throw_delegate.so.2605.0.0 /usr/lib64/libabsl_source_location.so.2605.0.0 /usr/lib64/libabsl_int128.so.2605.0.0 /usr/lib64/libabsl_civil_time.so.2605.0.0 /usr/lib64/libabsl_time_zone.so.2605.0.0 /usr/lib64/libabsl_tracing_internal.so.2605.0.0 /usr/lib64/libabsl_base.so.2605.0.0 /usr/lib64/libabsl_raw_logging_internal.so.2605.0.0 /usr/lib64/libabsl_log_severity.so.2605.0.0 /usr/lib64/libabsl_spinlock_wait.so.2605.0.0 /usr/lib64/libXcomposite.so /usr/lib64/libXdamage.so /usr/lib64/libXext.so /usr/lib64/libXfixes.so /usr/lib64/libXrandr.so /usr/lib64/libXrender
 .so /usr/lib64/libX11.so /usr/lib64/libXtst.so /usr/lib64/libXi.so ../cmake/external/cld3/libexternal_cld3_bundled.a /usr/lib64/libprotobuf-lite.so.31.1.0 /usr/lib64/libabsl_log_internal_check_op.so.2605.0.0 /usr/lib64/libabsl_die_if_null.so.2605.0.0 /usr/lib64/libabsl_log_internal_conditions.so.2605.0.0 /usr/lib64/libabsl_log_internal_message.so.2605.0.0 /usr/lib64/libabsl_log_internal_nullguard.so.2605.0.0 /usr/lib64/libabsl_examine_stack.so.2605.0.0 /usr/lib64/libabsl_log_internal_format.so.2605.0.0 /usr/lib64/libabsl_log_internal_structured_proto.so.2605.0.0 /usr/lib64/libabsl_log_internal_log_sink_set.so.2605.0.0 /usr/lib64/libabsl_log_sink.so.2605.0.0 /usr/lib64/libabsl_log_entry.so.2605.0.0 /usr/lib64/libabsl_log_internal_proto.so.2605.0.0 /usr/lib64/libabsl_flags_internal.so.2605.0.0 /usr/lib64/libabsl_flags_marshalling.so.2605.0.0 /usr/lib64/libabsl_flags_reflection.so.2605.0.0 /usr/lib64/libabsl_flags_config.so.2605.0.0 /usr/lib64/libabsl_flags_program_name.so.2605.0.0 /us
 r/lib64/libabsl_flags_private_handle_accessor.so.2605.0.0 /usr/lib64/libabsl_flags_commandlineflag.so.2605.0.0 /usr/lib64/libabsl_flags_commandlineflag_internal.so.2605.0.0 /usr/lib64/libabsl_log_initialize.so.2605.0.0 /usr/lib64/libabsl_log_internal_globals.so.2605.0.0 /usr/lib64/libabsl_log_globals.so.2605.0.0 /usr/lib64/libabsl_vlog_config_internal.so.2605.0.0 /usr/lib64/libabsl_log_internal_fnmatch.so.2605.0.0 /usr/lib64/libabsl_raw_hash_set.so.2605.0.0 /usr/lib64/libabsl_hashtablez_sampler.so.2605.0.0 /usr/lib64/libabsl_random_distributions.so.2605.0.0 /usr/lib64/libabsl_random_seed_sequences.so.2605.0.0 /usr/lib64/libabsl_random_internal_entropy_pool.so.2605.0.0 /usr/lib64/libabsl_random_internal_randen.so.2605.0.0 /usr/lib64/libabsl_random_internal_randen_hwaes.so.2605.0.0 /usr/lib64/libabsl_random_internal_randen_hwaes_impl.so.2605.0.0 /usr/lib64/libabsl_random_internal_randen_slow.so.2605.0.0 /usr/lib64/libabsl_random_internal_platform.so.2605.0.0 /usr/lib64/libabsl_random_
 internal_seed_material.so.2605.0.0 /usr/lib64/libabsl_random_seed_gen_exception.so.2605.0.0 /usr/lib64/libabsl_statusor.so.2605.0.0 /usr/lib64/libabsl_status.so.2605.0.0 /usr/lib64/libabsl_cord.so.2605.0.0 /usr/lib64/libabsl_cordz_info.so.2605.0.0 /usr/lib64/libabsl_cord_internal.so.2605.0.0 /usr/lib64/libabsl_hash.so.2605.0.0 /usr/lib64/libabsl_city.so.2605.0.0 /usr/lib64/libabsl_cordz_functions.so.2605.0.0 /usr/lib64/libabsl_exponential_biased.so.2605.0.0 /usr/lib64/libabsl_cordz_handle.so.2605.0.0 /usr/lib64/libabsl_crc_cord_state.so.2605.0.0 /usr/lib64/libabsl_crc32c.so.2605.0.0 /usr/lib64/libabsl_crc_internal.so.2605.0.0 /usr/lib64/libabsl_crc_cpu_detect.so.2605.0.0 /usr/lib64/libabsl_leak_check.so.2605.0.0 /usr/lib64/libabsl_strerror.so.2605.0.0 /usr/lib64/libabsl_str_format_internal.so.2605.0.0 /usr/lib64/libabsl_synchronization.so.2605.0.0 /usr/lib64/libabsl_stacktrace.so.2605.0.0 /usr/lib64/libabsl_symbolize.so.2605.0.0 /usr/lib64/libabsl_debugging_internal.so.2605.0.0 /usr
 /lib64/libabsl_demangle_internal.so.2605.0.0 /usr/lib64/libabsl_demangle_rust.so.2605.0.0 /usr/lib64/libabsl_decode_rust_punycode.so.2605.0.0 /usr/lib64/libabsl_utf8_for_code_point.so.2605.0.0 /usr/lib64/libabsl_graphcycles_internal.so.2605.0.0 /usr/lib64/libabsl_kernel_timeout_internal.so.2605.0.0 /usr/lib64/libabsl_malloc_internal.so.2605.0.0 /usr/lib64/libabsl_tracing_internal.so.2605.0.0 /usr/lib64/libabsl_time.so.2605.0.0 /usr/lib64/libabsl_civil_time.so.2605.0.0 /usr/lib64/libabsl_time_zone.so.2605.0.0 /usr/lib64/libabsl_strings.so.2605.0.0 /usr/lib64/libabsl_int128.so.2605.0.0 /usr/lib64/libabsl_source_location.so.2605.0.0 /usr/lib64/libabsl_strings_internal.so.2605.0.0 /usr/lib64/libabsl_base.so.2605.0.0 /usr/lib64/libabsl_spinlock_wait.so.2605.0.0 /usr/lib64/libabsl_throw_delegate.so.2605.0.0 /usr/lib64/libabsl_raw_logging_internal.so.2605.0.0 /usr/lib64/libabsl_log_severity.so.2605.0.0 liblib_prisma.a /usr/lib64/libboost_regex.so.1.86.0 lib_ui/liblib_ui.a /usr/lib64/libjpe
 g.so /usr/lib64/liblz4.so lib_webview/liblib_webview_Webview_dbus.a ../cmake/external/cmark_gfm/cmark-gfm-build/extensions/libcmark-gfm-extensions.a ../cmake/external/cmark_gfm/cmark-gfm-build/src/libcmark-gfm.a ../cmake/exte/usr/bin/ld.bfd: liblib_tgcalls.a(ReflectorPort.cpp.o): in function `tgcalls::ReflectorPort::CreateReflectorClientSocket()':
[riscv64] ReflectorPort.cpp:(.text+0x20c2): undefined reference to `rtc::AsyncPacketSocket::RegisterReceivedPacketCallback(absl::lts_20260526::AnyInvocable<void (rtc::AsyncPacketSocket*, rtc::ReceivedPacket const&)>)'
[riscv64] /usr/bin/ld.bfd: relocation R_RISCV_CALL_PLT against `_ZN3rtc17AsyncPacketSocket30RegisterReceivedPacketCallbackEN4absl12lts_2026052612AnyInvocableIFvPS0_RKNS_14ReceivedPacketEEEE' which may bind externally can not be used when making a shared object; recompile with -fPIC
[riscv64] /usr/bin/ld.bfd: /usr/lib64/libtg_owt.a(media_session.cc.o): in function `std::char_traits<char>::length(char const*)':
[riscv64] /usr/include/c++/15/bits/char_traits.h:393:(.text+0x1ae): undefined reference to `absl::lts_20250127::EqualsIgnoreCase(std::basic_string_view<char, std::char_traits<char> >, std::basic_string_view<char, std::char_traits<char> >)'
[riscv64] /usr/bin/ld.bfd: relocation R_RISCV_CALL_PLT against `_ZN4absl12lts_2025012716EqualsIgnoreCaseESt17basic_string_viewIcSt11char_traitsIcEES4_' which may bind externally can not be used when making a shared object; recompile with -fPIC
[riscv64] /usr/bin/ld.bfd: /usr/lib64/libtg_owt.a(webrtc_video_engine.cc.o): in function `non-virtual thunk to cricket::WebRtcVideoReceiveChannel::OnPacketReceived(webrtc::RtpPacketReceived const&)':
[riscv64] /usr/src/RPM/BUILD/libowt-tg-4.3.0.15/src/media/engine/webrtc_video_engine.h:602:(.text+0x308a): undefined reference to `absl::lts_20250127::EqualsIgnoreCase(std::basic_string_view<char, std::char_traits<char> >, std::basic_string_view<char, std::char_traits<char> >)'
[riscv64] /usr/bin/ld.bfd: relocation R_RISCV_CALL_PLT against `_ZN4absl12lts_2025012716EqualsIgnoreCaseESt17basic_string_viewIcSt11char_traitsIcEES4_' which may bind externally can not be used when making a shared object; recompile with -fPIC
[riscv64] /usr/bin/ld.bfd: /usr/lib64/libtg_owt.a(webrtc_voice_engine.cc.o): in function `std::_Rb_tree<unsigned int, std::pair<unsigned int const, cricket::WebRtcVoiceSendChannel::WebRtcAudioSendStream*>, std::_Select1st<std::pair<unsigned int const, cricket::WebRtcVoiceSendChannel::WebRtcAudioSendStream*> >, std::less<unsigned int>, std::allocator<std::pair<unsigned int const, cricket::WebRtcVoiceSendChannel::WebRtcAudioSendStream*> > >::_M_lower_bound(std::_Rb_tree_node_base*, std::_Rb_tree_node_base*, unsigned int const&) const':
[riscv64] /usr/include/c++/15/bits/stl_tree.h:2603:(.text+0x6b78): undefined reference to `absl::lts_20250127::EqualsIgnoreCase(std::basic_string_view<char, std::char_traits<char> >, std::basic_string_view<char, std::char_traits<char> >)'
[riscv64] /usr/bin/ld.bfd: relocation R_RISCV_CALL_PLT against `_ZN4absl12lts_2025012716EqualsIgnoreCaseESt17basic_string_viewIcSt11char_traitsIcEES4_' which may bind externally can not be used when making a shared object; recompile with -fPIC
[riscv64] /usr/bin/ld.bfd: /usr/lib64/libtg_owt.a(peer_connection.cc.o): in function `webrtc::PeerConnection::ReportFirstConnectUsageMetrics()':
[riscv64] /usr/include/c++/15/bits/stl_algobase.h:2095:(.text+0x5f46): undefined reference to `absl::lts_20250127::EqualsIgnoreCase(std::basic_string_view<char, std::char_traits<char> >, std::basic_string_view<char, std::char_traits<char> >)'
[riscv64] /usr/bin/ld.bfd: relocation R_RISCV_CALL_PLT against `_ZN4absl12lts_2025012716EqualsIgnoreCaseESt17basic_string_viewIcSt11char_traitsIcEES4_' which may bind externally can not be used when making a shared object; recompile with -fPIC
[riscv64] /usr/bin/ld.bfd: /usr/lib64/libtg_owt.a(audio_decoder_L16.cc.o): in function `webrtc::AudioDecoderL16::SdpToConfig(webrtc::SdpAudioFormat const&)':
[riscv64] /usr/src/RPM/BUILD/libowt-tg-4.3.0.15/src/api/audio_codecs/L16/audio_decoder_L16.cc:27:(.text+0x30): undefined reference to `absl::lts_20250127::EqualsIgnoreCase(std::basic_string_view<char, std::char_traits<char> >, std::basic_string_view<char, std::char_traits<char> >)'
[riscv64] /usr/bin/ld.bfd: relocation R_RISCV_CALL_PLT against `_ZN4absl12lts_2025012716EqualsIgnoreCaseESt17basic_string_viewIcSt11char_traitsIcEES4_' which may bind externally can not be used when making a shared object; recompile with -fPIC
[riscv64] /usr/bin/ld.bfd: /usr/lib64/libtg_owt.a(audio_encoder_L16.cc.o):/usr/src/RPM/BUILD/libowt-tg-4.3.0.15/src/api/audio_codecs/L16/audio_encoder_L16.cc:40: more undefined references to `absl::lts_20250127::EqualsIgnoreCase(std::basic_string_view<char, std::char_traits<char> >, std::basic_string_view<char, std::char_traits<char> >)' follow
[riscv64] /usr/bin/ld.bfd: relocation R_RISCV_CALL_PLT against `_ZN4absl12lts_2025012716EqualsIgnoreCaseESt17basic_string_viewIcSt11char_traitsIcEES4_' which may bind externally can not be used when making a shared object; recompile with -fPIC
[riscv64] /usr/bin/ld.bfd: /usr/lib64/libtg_owt.a(webrtc_sdp.cc.o): in function `absl::lts_20250127::ascii_isspace(unsigned char)':
[riscv64] /usr/src/RPM/BUILD/libowt-tg-4.3.0.15/src/pc/webrtc_sdp.cc:2848:(.text._ZN4absl12lts_2025012713ascii_isspaceEh[_ZN4absl12lts_2025012713ascii_isspaceEh]+0x0): undefined reference to `absl::lts_20250127::ascii_internal::kPropertyBits'
[riscv64] /usr/bin/ld.bfd: /usr/lib64/libtg_owt.a(codec.cc.o): in function `cricket::FeedbackParam::operator==(cricket::FeedbackParam const&) const':
[riscv64] /usr/src/RPM/BUILD/libowt-tg-4.3.0.15/src/media/base/codec.cc:98:(.text+0x1b4): undefined reference to `absl::lts_20250127::EqualsIgnoreCase(std::basic_string_view<char, std::char_traits<char> >, std::basic_string_view<char, std::char_traits<char> >)'
[riscv64] /usr/bin/ld.bfd: relocation R_RISCV_CALL_PLT against `_ZN4absl12lts_2025012716EqualsIgnoreCaseESt17basic_string_viewIcSt11char_traitsIcEES4_' which may bind externally can not be used when making a shared object; recompile with -fPIC
[riscv64] /usr/bin/ld.bfd: /usr/lib64/libtg_owt.a(internal_decoder_factory.cc.o): in function `std::char_traits<char>::length(char const*)':
[riscv64] /usr/include/c++/15/bits/char_traits.h:393:(.text+0x17c): undefined reference to `absl::lts_20250127::EqualsIgnoreCase(std::basic_string_view<char, std::char_traits<char> >, std::basic_string_view<char, std::char_traits<char> >)'
[riscv64] /usr/bin/ld.bfd: relocation R_RISCV_CALL_PLT against `_ZN4absl12lts_2025012716EqualsIgnoreCaseESt17basic_string_viewIcSt11char_traitsIcEES4_' which may bind externally can not be used when making a shared object; recompile with -fPIC
2026-Jul-13 12:22:53 :: [riscv64] telegram-desktop-6.9.3-alt2.src.rpm: remote: build failed
2026-Jul-13 12:22:53 :: [riscv64] #100 telegram-desktop-6.9.3-alt2.src.rpm: build FAILED
2026-Jul-13 12:22:53 :: [riscv64] requesting cancellation of task processing
2026-Jul-13 12:22:53 :: [riscv64] build FAILED
2026-Jul-13 12:22:53 :: task #132400 for sisyphus_riscv64 FAILED


More information about the Riscv-reports mailing list