[riscv-reports] [#132523] sisyphus_riscv64 FAILED srpm=rustdesk-1.4.9-alt1.src.rpm

Girar sisyphus_riscv64 awaiter recycler noreply at basealt.ru
Mon Jul 13 12:59:44 MSK 2026


http://web.build.srt.basealt.ru/tasks/132523/logs/events.1.1.log

2026-Jul-13 09:57:58 :: shared task #132523 for sisyphus_riscv64 started by recycler:
2026-Jul-13 09:57:58 :: message: sync
#100 build rustdesk-1.4.9-alt1.src.rpm
2026-Jul-13 09:58:02 :: [riscv64] #100 rustdesk-1.4.9-alt1.src.rpm: build start
2026-Jul-13 09:59:43 :: [riscv64] #100 rustdesk-1.4.9-alt1.src.rpm: build SKIPPED
2026-Jul-13 09:59:44 :: #100: rustdesk-1.4.9-alt1.src.rpm: no source package
2026-Jul-13 09:59:44 :: build check FAILED for: #100 
2026-Jul-13 09:59:44 :: task #132523 for sisyphus_riscv64 FAILED


More information about the Riscv-reports mailing list