[riscv-reports] [#132498] sisyphus_riscv64 FAILED srpm=keycloak-26.7.0-alt1.src.rpm

Girar sisyphus_riscv64 awaiter recycler noreply at basealt.ru
Mon Jul 13 11:18:38 MSK 2026


http://web.build.srt.basealt.ru/tasks/132498/logs/events.1.1.log

2026-Jul-13 08:15:04 :: shared task #132498 for sisyphus_riscv64 started by recycler:
2026-Jul-13 08:15:04 :: message: sync
#100 build keycloak-26.7.0-alt1.src.rpm
2026-Jul-13 08:15:07 :: [riscv64] #100 keycloak-26.7.0-alt1.src.rpm: build start
2026-Jul-13 08:18:35 :: [riscv64] #100 keycloak-26.7.0-alt1.src.rpm: build SKIPPED
2026-Jul-13 08:18:38 :: #100: keycloak-26.7.0-alt1.src.rpm: no source package
2026-Jul-13 08:18:38 :: build check FAILED for: #100 
2026-Jul-13 08:18:38 :: task #132498 for sisyphus_riscv64 FAILED


More information about the Riscv-reports mailing list