[riscv-reports] [#132451] sisyphus_riscv64 FAILED srpm=zed-1.10.2-alt1.src.rpm

Girar sisyphus_riscv64 awaiter recycler noreply at basealt.ru
Sun Jul 12 02:12:15 MSK 2026


http://web.build.srt.basealt.ru/tasks/132451/logs/events.1.1.log

2026-Jul-11 23:10:22 :: shared task #132451 for sisyphus_riscv64 started by recycler:
2026-Jul-11 23:10:22 :: message: sync
#100 build zed-1.10.2-alt1.src.rpm
2026-Jul-11 23:10:27 :: [riscv64] #100 zed-1.10.2-alt1.src.rpm: build start
2026-Jul-11 23:12:14 :: [riscv64] #100 zed-1.10.2-alt1.src.rpm: build SKIPPED
2026-Jul-11 23:12:15 :: #100: zed-1.10.2-alt1.src.rpm: no source package
2026-Jul-11 23:12:15 :: build check FAILED for: #100 
2026-Jul-11 23:12:15 :: task #132451 for sisyphus_riscv64 FAILED


More information about the Riscv-reports mailing list