[riscv-reports] [#132241] [test-only] sisyphus_riscv64 FAILED (try 4) srpm=percona-xtrabackup84-8.4.0-alt2.src.rpm ...

Girar sisyphus_riscv64 awaiter iv noreply at basealt.ru
Sun Jul 12 01:32:10 MSK 2026


http://web.build.srt.basealt.ru/tasks/132241/logs/events.4.1.log

subtask  name              riscv64
  #2200  fcitx5-mozc        failed
  #3400  pure-maps          failed
  #3500  onnxruntime        failed
  #4000  telegram-desktop   failed
  #4200  libopencv         2:15:33
  #4300  ayugram-desktop    failed
  #4400  osgearth            22:57
  #4500  libvalhalla         15:51
  #4600  mixxx               46:14
  #4700  grpc1.70            21:00
  #5000  ncnn                17:11
  #5100  libopenshot         15:17
  #5200  kicad             1:50:56
  #5300  PokerTH             16:17
  #5400  mumble              12:41
  #5500  osmscout-server     19:50
  #5600  marble              55:46
  #5700  merkaartor           9:52

2026-Jul-11 06:43:21 :: test-only task #132241 for sisyphus_riscv64 resumed by iv:
2026-Jul-11 06:43:21 :: message: rebuild_with_new_protobuf
#100 removed
#200 build percona-xtrabackup84-8.4.0-alt2.src.rpm from sisyphus_riscv64
#300 build libphonenumber-9.0.34-alt1.src.rpm from sisyphus_riscv64
#400 build icinga2-2.16.0-alt1.src.rpm from sisyphus_riscv64
#500 build android-tools-34.0.5-alt6.src.rpm from sisyphus_riscv64
#600 build sentencepiece-0.2.1-alt1.src.rpm from sisyphus_riscv64
#700 build mosh-1.4.0-alt1.2.src.rpm from sisyphus_riscv64
#1000 build compiz-0.9.14.2-alt3.4.src.rpm from sisyphus_riscv64
#1100 build percona-xtrabackup80-8.0.35-alt10.src.rpm from sisyphus_riscv64
#1200 build protobuf-c-1.5.2-alt1.src.rpm from sisyphus_riscv64
#1300 build libre2-20251105-alt1.src.rpm from sisyphus_riscv64
#1400 build hidviz-0.2.1-alt1.src.rpm from sisyphus_riscv64
#1500 build libArcus-5.11.1-alt2.src.rpm from sisyphus_riscv64
#1600 build usbguard-1.1.4-alt2.src.rpm from sisyphus_riscv64
#1700 build libwebrtc-audio-processing-2-2.1-alt2.src.rpm from sisyphus_riscv64
#2000 build libprotobuf-mutator-1.5-alt1.src.rpm from sisyphus_riscv64
#2100 build osmpbf-1.5.0-alt1_12jpp11.src.rpm from sisyphus_riscv64
#2200 build fcitx5-mozc-2.31.5712-alt2_1.src.rpm from sisyphus_riscv64
#2300 build kismet-0.0.2023.07.R2-alt1_1.src.rpm from sisyphus_riscv64
#2400 build purple-whatsapp-0.9.0-alt1.5.src.rpm from sisyphus_riscv64
#2500 build python3-module-grpcio-1.80.0-alt2.src.rpm from sisyphus_riscv64
#2600 build qt6-grpc-6.10.3-alt3.src.rpm from sisyphus_riscv64
#2700 build bloaty-1.1-alt2.git3f36ed.src.rpm from sisyphus_riscv64
#3000 build libopentelemetry-1.22.0-alt1.src.rpm from sisyphus_riscv64
#3100 build bear-3.1.5-alt1.src.rpm from sisyphus_riscv64
#3200 build hyprland-0.54.3-alt1.src.rpm from sisyphus_riscv64
#3300 build CuraEngine-5.13.0-alt1.src.rpm from sisyphus_riscv64
#3400 build pure-maps-3.5.0-alt1.src.rpm from sisyphus_riscv64
#3500 build onnxruntime-1.23.0-alt1.src.rpm from sisyphus_riscv64
#3600 build clementine-1.4.1.59-alt1.gebeb3ac61.src.rpm from sisyphus_riscv64
#3700 build vlc-3.0.23-alt3.src.rpm from sisyphus_riscv64
#4000 build telegram-desktop-6.8.2-alt1.src.rpm from sisyphus_riscv64
#4100 build warzone2100-4.7.0-alt2.src.rpm from sisyphus_riscv64
#4200 build libopencv-4.13.0-alt1.src.rpm from sisyphus_riscv64
#4300 build ayugram-desktop-6.3.10-alt1.src.rpm from sisyphus_riscv64
#4400 build osgearth-3.8.1-alt1.src.rpm from sisyphus_riscv64
#4500 build libvalhalla-3.5.1-alt1.src.rpm from sisyphus_riscv64
#4600 build mixxx-2.5.6-alt1.src.rpm from sisyphus_riscv64
#4700 build grpc1.70-1.70.1-alt2.src.rpm from sisyphus_riscv64
#5000 build 20260113-alt0.port from /gears/n/ncnn.git fetched at 2026-Jul-09 12:10:10 from sisyphus_riscv64
#5100 build libopenshot-0.6.0-alt1.src.rpm from sisyphus_riscv64
#5200 build kicad-10.0.4-alt1.src.rpm from sisyphus_riscv64
#5300 build PokerTH-2.0.7-alt1.src.rpm from sisyphus_riscv64
#5400 build mumble-1.4.287-alt2.4.src.rpm from sisyphus_riscv64
#5500 build osmscout-server-3.1.5-alt2.src.rpm from sisyphus_riscv64
#5600 build marble-26.04.2-alt1.src.rpm from sisyphus_riscv64
#5700 build merkaartor-0.20.0-alt1.src.rpm from sisyphus_riscv64
2026-Jul-11 06:43:21 :: created build repo
2026-Jul-11 06:43:23 :: [riscv64] #200 percona-xtrabackup84-8.4.0-alt2.src.rpm: build start
2026-Jul-11 06:43:44 :: [riscv64] #200 percona-xtrabackup84-8.4.0-alt2.src.rpm: build swiftly SKIPPED
2026-Jul-11 06:43:45 :: [riscv64] #300 libphonenumber-9.0.34-alt1.src.rpm: build start
2026-Jul-11 06:43:48 :: [riscv64] #300 libphonenumber-9.0.34-alt1.src.rpm: build swiftly SKIPPED
2026-Jul-11 06:43:48 :: [riscv64] #400 icinga2-2.16.0-alt1.src.rpm: build start
2026-Jul-11 06:43:52 :: [riscv64] #400 icinga2-2.16.0-alt1.src.rpm: build swiftly SKIPPED
2026-Jul-11 06:43:52 :: [riscv64] #500 android-tools-34.0.5-alt6.src.rpm: build start
2026-Jul-11 06:43:56 :: [riscv64] #500 android-tools-34.0.5-alt6.src.rpm: build swiftly SKIPPED
2026-Jul-11 06:43:56 :: [riscv64] #600 sentencepiece-0.2.1-alt1.src.rpm: build start
2026-Jul-11 06:43:59 :: [riscv64] #600 sentencepiece-0.2.1-alt1.src.rpm: build swiftly SKIPPED
2026-Jul-11 06:43:59 :: [riscv64] #700 mosh-1.4.0-alt1.2.src.rpm: build start
2026-Jul-11 06:44:01 :: [riscv64] #700 mosh-1.4.0-alt1.2.src.rpm: build swiftly SKIPPED
2026-Jul-11 06:44:01 :: [riscv64] #1000 compiz-0.9.14.2-alt3.4.src.rpm: build start
2026-Jul-11 06:44:04 :: [riscv64] #1000 compiz-0.9.14.2-alt3.4.src.rpm: build swiftly SKIPPED
2026-Jul-11 06:44:04 :: [riscv64] #1100 percona-xtrabackup80-8.0.35-alt10.src.rpm: build start
2026-Jul-11 06:44:27 :: [riscv64] #1100 percona-xtrabackup80-8.0.35-alt10.src.rpm: build swiftly SKIPPED
2026-Jul-11 06:44:27 :: [riscv64] #1200 protobuf-c-1.5.2-alt1.src.rpm: build start
2026-Jul-11 06:44:29 :: [riscv64] #1200 protobuf-c-1.5.2-alt1.src.rpm: build swiftly SKIPPED
2026-Jul-11 06:44:29 :: [riscv64] #1300 libre2-20251105-alt1.src.rpm: build start
2026-Jul-11 06:44:31 :: [riscv64] #1300 libre2-20251105-alt1.src.rpm: build swiftly SKIPPED
2026-Jul-11 06:44:32 :: [riscv64] #1400 hidviz-0.2.1-alt1.src.rpm: build start
2026-Jul-11 06:44:34 :: [riscv64] #1400 hidviz-0.2.1-alt1.src.rpm: build swiftly SKIPPED
2026-Jul-11 06:44:34 :: [riscv64] #1500 libArcus-5.11.1-alt2.src.rpm: build start
2026-Jul-11 06:44:36 :: [riscv64] #1500 libArcus-5.11.1-alt2.src.rpm: build swiftly SKIPPED
2026-Jul-11 06:44:36 :: [riscv64] #1600 usbguard-1.1.4-alt2.src.rpm: build start
2026-Jul-11 06:44:39 :: [riscv64] #1600 usbguard-1.1.4-alt2.src.rpm: build swiftly SKIPPED
2026-Jul-11 06:44:39 :: [riscv64] #1700 libwebrtc-audio-processing-2-2.1-alt2.src.rpm: build start
2026-Jul-11 06:44:41 :: [riscv64] #1700 libwebrtc-audio-processing-2-2.1-alt2.src.rpm: build swiftly SKIPPED
2026-Jul-11 06:44:41 :: [riscv64] #2000 libprotobuf-mutator-1.5-alt1.src.rpm: build start
2026-Jul-11 06:44:43 :: [riscv64] #2000 libprotobuf-mutator-1.5-alt1.src.rpm: build swiftly SKIPPED
2026-Jul-11 06:44:43 :: [riscv64] #2100 osmpbf-1.5.0-alt1_12jpp11.src.rpm: build start
2026-Jul-11 06:44:46 :: [riscv64] #2100 osmpbf-1.5.0-alt1_12jpp11.src.rpm: build swiftly SKIPPED
2026-Jul-11 06:44:46 :: [riscv64] #2200 fcitx5-mozc-2.31.5712-alt2_1.src.rpm: build start
[riscv64] /usr/src/RPM/BUILD/mozc/src/base/strings/unicode.h:128:55: error: expected primary-expression before ‘>’ token
[riscv64]   128 | inline void StrAppendChar32(absl::Nonnull<std::string*> dest,
[riscv64] /usr/src/RPM/BUILD/mozc/src/base/strings/unicode.h:128:57: error: ‘dest’ was not declared in this scope
[riscv64]   128 | inline void StrAppendChar32(absl::Nonnull<std::string*> dest,
[riscv64] /usr/src/RPM/BUILD/mozc/src/base/strings/unicode.h:129:29: error: expected primary-expression before ‘const’
[riscv64]   129 |                             const char32_t cp) {
[riscv64] /usr/src/RPM/BUILD/mozc/src/base/strings/unicode.h: In function ‘std::string mozc::strings::Char32ToUtf8(char32_t)’:
[riscv64] /usr/src/RPM/BUILD/mozc/src/base/strings/unicode.h:138:3: error: ‘StrAppendChar32’ was not declared in this scope
[riscv64]   138 |   StrAppendChar32(&result, cp);
[riscv64] --
[riscv64] [81/441] c++ -MMD -MF obj/base/base_core.util.o.d -DMOZC_GYP_BUILD -DMOZC_BUILD -DCHANNEL_DEV '-DMOZC_SERVER_DIR="/usr/lib/fcitx5-mozc"' '-DMOZC_DOCUMENT_DIR="/usr/share/licenses/fcitx5-mozc"' -DNDEBUG -DQT_NO_DEBUG -DABSL_MIN_LOG_LEVEL=100 -DIGNORE_HELP_FLAG -DIGNORE_INVALID_FLAG -I../../third_party/abseil-cpp -I/usr/src/RPM/BUILD/mozc/src -Igen -fmessage-length=0 -fno-strict-aliasing -funsigned-char -pipe -pthread -fno-omit-frame-pointer -fstack-protector --param=ssp-buffer-size=4 -Wall -Wno-char-subscripts -Wno-sign-compare -Wno-deprecated-declarations -Wwrite-strings -Wno-unknown-warning-option -Wno-inconsistent-missing-override -fPIC -fno-exceptions -Wtype-limits -O2 -Wno-deprecated -Wno-covered-switch-default -Wno-unnamed-type-template-args -Wno-c++11-narrowing -std=c++20  -c ../../base/util.cc -o obj/base/base_core.util.o
[riscv64] FAILED: [code=1] obj/base/base_core.util.o 
[riscv64] c++ -MMD -MF obj/base/base_core.util.o.d -DMOZC_GYP_BUILD -DMOZC_BUILD -DCHANNEL_DEV '-DMOZC_SERVER_DIR="/usr/lib/fcitx5-mozc"' '-DMOZC_DOCUMENT_DIR="/usr/share/licenses/fcitx5-mozc"' -DNDEBUG -DQT_NO_DEBUG -DABSL_MIN_LOG_LEVEL=100 -DIGNORE_HELP_FLAG -DIGNORE_INVALID_FLAG -I../../third_party/abseil-cpp -I/usr/src/RPM/BUILD/mozc/src -Igen -fmessage-length=0 -fno-strict-aliasing -funsigned-char -pipe -pthread -fno-omit-frame-pointer -fstack-protector --param=ssp-buffer-size=4 -Wall -Wno-char-subscripts -Wno-sign-compare -Wno-deprecated-declarations -Wwrite-strings -Wno-unknown-warning-option -Wno-inconsistent-missing-override -fPIC -fno-exceptions -Wtype-limits -O2 -Wno-deprecated -Wno-covered-switch-default -Wno-unnamed-type-template-args -Wno-c++11-narrowing -std=c++20  -c ../../base/util.cc -o obj/base/base_core.util.o
[riscv64] In file included from ../../base/util.cc:54:
[riscv64] /usr/src/RPM/BUILD/mozc/src/base/strings/unicode.h:128:13: error: variable or field ‘StrAppendChar32’ declared void
[riscv64]   128 | inline void StrAppendChar32(absl::Nonnull<std::string*> dest,
[riscv64] /usr/src/RPM/BUILD/mozc/src/base/strings/unicode.h:128:35: error: ‘Nonnull’ is not a member of ‘absl’
[riscv64]   128 | inline void StrAppendChar32(absl::Nonnull<std::string*> dest,
[riscv64] /usr/src/RPM/BUILD/mozc/src/base/strings/unicode.h:128:54: error: expected primary-expression before ‘*’ token
[riscv64]   128 | inline void StrAppendChar32(absl::Nonnull<std::string*> dest,
[riscv64] /usr/src/RPM/BUILD/mozc/src/base/strings/unicode.h:128:55: error: expected primary-expression before ‘>’ token
[riscv64]   128 | inline void StrAppendChar32(absl::Nonnull<std::string*> dest,
[riscv64] /usr/src/RPM/BUILD/mozc/src/base/strings/unicode.h:128:57: error: ‘dest’ was not declared in this scope
[riscv64]   128 | inline void StrAppendChar32(absl::Nonnull<std::string*> dest,
2026-Jul-11 06:50:52 :: [riscv64] fcitx5-mozc-2.31.5712-alt2_1.src.rpm: remote: build failed
2026-Jul-11 06:50:52 :: [riscv64] #2200 fcitx5-mozc-2.31.5712-alt2_1.src.rpm: build FAILED
2026-Jul-11 06:50:52 :: [riscv64] #2200 fcitx5-mozc-2.31.5712-alt2_1.src.rpm:: KEEP_GOING cheat activated, moving on
2026-Jul-11 06:50:53 :: [riscv64] #2300 kismet-0.0.2023.07.R2-alt1_1.src.rpm: build start
2026-Jul-11 06:50:57 :: [riscv64] #2300 kismet-0.0.2023.07.R2-alt1_1.src.rpm: build swiftly SKIPPED
2026-Jul-11 06:50:58 :: [riscv64] #2400 purple-whatsapp-0.9.0-alt1.5.src.rpm: build start
2026-Jul-11 06:51:00 :: [riscv64] #2400 purple-whatsapp-0.9.0-alt1.5.src.rpm: build swiftly SKIPPED
2026-Jul-11 06:51:00 :: [riscv64] #2500 python3-module-grpcio-1.80.0-alt2.src.rpm: build start
2026-Jul-11 06:51:05 :: [riscv64] #2500 python3-module-grpcio-1.80.0-alt2.src.rpm: build swiftly SKIPPED
2026-Jul-11 06:51:05 :: [riscv64] #2600 qt6-grpc-6.10.3-alt3.src.rpm: build start
2026-Jul-11 06:51:07 :: [riscv64] #2600 qt6-grpc-6.10.3-alt3.src.rpm: build swiftly SKIPPED
2026-Jul-11 06:51:07 :: [riscv64] #2700 bloaty-1.1-alt2.git3f36ed.src.rpm: build start
2026-Jul-11 06:51:10 :: [riscv64] #2700 bloaty-1.1-alt2.git3f36ed.src.rpm: build swiftly SKIPPED
2026-Jul-11 06:51:10 :: [riscv64] #3000 libopentelemetry-1.22.0-alt1.src.rpm: build start
2026-Jul-11 06:51:13 :: [riscv64] #3000 libopentelemetry-1.22.0-alt1.src.rpm: build swiftly SKIPPED
2026-Jul-11 06:51:13 :: [riscv64] #3100 bear-3.1.5-alt1.src.rpm: build start
2026-Jul-11 06:51:15 :: [riscv64] #3100 bear-3.1.5-alt1.src.rpm: build swiftly SKIPPED
2026-Jul-11 06:51:15 :: [riscv64] #3200 hyprland-0.54.3-alt1.src.rpm: build start
2026-Jul-11 06:51:21 :: [riscv64] #3200 hyprland-0.54.3-alt1.src.rpm: build swiftly SKIPPED
2026-Jul-11 06:51:21 :: [riscv64] #3300 CuraEngine-5.13.0-alt1.src.rpm: build start
2026-Jul-11 06:51:24 :: [riscv64] #3300 CuraEngine-5.13.0-alt1.src.rpm: build swiftly SKIPPED
2026-Jul-11 06:51:24 :: [riscv64] #3400 pure-maps-3.5.0-alt1.src.rpm: build start
[riscv64]                  from /usr/src/RPM/BUILD/pure-maps-3.5.0/src/locationmodel.cpp:2:
[riscv64] /usr/include/s2/util/gtl/compact_array.h:52:10: fatal error: absl/base/internal/throw_delegate.h: No such file or directory
[riscv64]    52 | #include "absl/base/internal/throw_delegate.h"
[riscv64] --
[riscv64]                  from /usr/src/RPM/BUILD/pure-maps-3.5.0/src/navigator.cpp:1:
[riscv64] /usr/include/s2/util/gtl/compact_array.h:52:10: fatal error: absl/base/internal/throw_delegate.h: No such file or directory
[riscv64]    52 | #include "absl/base/internal/throw_delegate.h"
[riscv64] --
[riscv64]                  from /usr/src/RPM/BUILD/pure-maps-3.5.0/src/navigatordbusadapter.cpp:1:
[riscv64] /usr/include/s2/util/gtl/compact_array.h:52:10: fatal error: absl/base/internal/throw_delegate.h: No such file or directory
[riscv64]    52 | #include "absl/base/internal/throw_delegate.h"
[riscv64] --
[riscv64]                  from /usr/src/RPM/BUILD/pure-maps-3.5.0/riscv64-alt-linux/src/pure-maps_autogen/mocs_compilation.cpp:10:
[riscv64] /usr/include/s2/util/gtl/compact_array.h:52:10: fatal error: absl/base/internal/throw_delegate.h: No such file or directory
[riscv64]    52 | #include "absl/base/internal/throw_delegate.h"
[riscv64] --
[riscv64]                  from /usr/src/RPM/BUILD/pure-maps-3.5.0/src/main.cpp:47:
[riscv64] /usr/include/s2/util/gtl/compact_array.h:52:10: fatal error: absl/base/internal/throw_delegate.h: No such file or directory
[riscv64]    52 | #include "absl/base/internal/throw_delegate.h"
2026-Jul-11 06:55:26 :: [riscv64] pure-maps-3.5.0-alt1.src.rpm: remote: build failed
2026-Jul-11 06:55:26 :: [riscv64] #3400 pure-maps-3.5.0-alt1.src.rpm: build FAILED
2026-Jul-11 06:55:26 :: [riscv64] #3400 pure-maps-3.5.0-alt1.src.rpm:: KEEP_GOING cheat activated, moving on
2026-Jul-11 06:55:27 :: [riscv64] #3500 onnxruntime-1.23.0-alt1.src.rpm: build start
[riscv64]     CMAKE_Fortran_FLAGS
[riscv64]     LIB_DESTINATION
[riscv64]     LIB_INSTALL_DIR
[riscv64]     LIB_SUFFIX
[riscv64]     SHARE_INSTALL_PREFIX
[riscv64]     SYSCONF_INSTALL_DIR
[riscv64] CMake Generate step failed.  Build files cannot be regenerated correctly.
[riscv64] error: Bad exit status from /usr/src/tmp/rpmb-tmp.3rOv4H (%build)
[riscv64] RPM build errors:
[riscv64]     Bad exit status from /usr/src/tmp/rpmb-tmp.3rOv4H (%build)
2026-Jul-11 07:01:33 :: [riscv64] onnxruntime-1.23.0-alt1.src.rpm: remote: build failed
2026-Jul-11 07:01:33 :: [riscv64] #3500 onnxruntime-1.23.0-alt1.src.rpm: build FAILED
2026-Jul-11 07:01:33 :: [riscv64] #3500 onnxruntime-1.23.0-alt1.src.rpm:: KEEP_GOING cheat activated, moving on
2026-Jul-11 07:01:34 :: [riscv64] #3600 clementine-1.4.1.59-alt1.gebeb3ac61.src.rpm: build start
2026-Jul-11 07:01:38 :: [riscv64] #3600 clementine-1.4.1.59-alt1.gebeb3ac61.src.rpm: build swiftly SKIPPED
2026-Jul-11 07:01:38 :: [riscv64] #3700 vlc-3.0.23-alt3.src.rpm: build start
2026-Jul-11 07:01:44 :: [riscv64] #3700 vlc-3.0.23-alt3.src.rpm: build swiftly SKIPPED
2026-Jul-11 07:01:44 :: [riscv64] #4000 telegram-desktop-6.8.2-alt1.src.rpm: build start
[riscv64] /usr/bin/c++ -pipe -frecord-gcc-switches -Wall -g0 -O2  -fpermissive -DNDEBUG -Wno-strict-aliasing -Wno-unused-variable -Wno-sign-compare -Wno-switch -fstack-protector-all -fstack-clash-protection -D_GLIBCXX_ASSERTIONS -O2 -DNDEBUG -Wno-alloc-size-larger-than -Wno-free-nonheap-object -Wno-stringop-overflow -Wno-stringop-overread -Wno-odr -Wno-inline -pthread -Wl,--as-needed -Wl,--dependency-file=CMakeFiles/Telegram.dir/link.d @CMakeFiles/Telegram.dir/objects1.rsp -o ../bin/Telegram  ../cmake/external/qt/qt_static_plugins/kimageformats/CMakeFiles/external_qt_static_plugins_kimageformats_init.dir/init.cpp.o ../cmake/external/qt/qt_static_plugins/nimf/CMakeFiles/external_qt_static_plugins_nimf_init.dir/init.cpp.o ../cmake/external/qt/qt_static_plugins/fcitx5/CMakeFiles/external_qt_static_plugins_fcitx5_init.dir/init.cpp.o ../cmake/external/qt/qt_static_plugins/hime/CMakeFiles/external_qt_static_plugins_hime_init.dir/init.cpp.o liblib_tgcalls.a lib_base/liblib_base.a lib_ui/lib
 lib_ui.a lib_spellcheck/liblib_spellcheck.a lib_webview/liblib_webview.a /usr/lib64/libminizip.so liblib_tgcalls.a /usr/lib64/librnnoise.so /usr/lib64/libopenal.so.1.25.2 ../cmake/external/cld3/libexternal_cld3_bundled.a /usr/lib64/libprotobuf-lite.so.31.1.0 /usr/lib64/libabsl_log_internal_check_op.so.2605.0.0 /usr/lib64/libabsl_die_if_null.so.2605.0.0 /usr/lib64/libabsl_log_internal_conditions.so.2605.0.0 /usr/lib64/libabsl_log_internal_message.so.2605.0.0 /usr/lib64/libabsl_log_internal_nullguard.so.2605.0.0 /usr/lib64/libabsl_examine_stack.so.2605.0.0 /usr/lib64/libabsl_log_internal_format.so.2605.0.0 /usr/lib64/libabsl_log_internal_structured_proto.so.2605.0.0 /usr/lib64/libabsl_log_internal_log_sink_set.so.2605.0.0 /usr/lib64/libabsl_log_sink.so.2605.0.0 /usr/lib64/libabsl_log_entry.so.2605.0.0 /usr/lib64/libabsl_log_internal_proto.so.2605.0.0 /usr/lib64/libabsl_flags_internal.so.2605.0.0 /usr/lib64/libabsl_flags_marshalling.so.2605.0.0 /usr/lib64/libabsl_flags_reflection.so.26
 05.0.0 /usr/lib64/libabsl_flags_config.so.2605.0.0 /usr/lib64/libabsl_flags_program_name.so.2605.0.0 /usr/lib64/libabsl_flags_private_handle_accessor.so.2605.0.0 /usr/lib64/libabsl_flags_commandlineflag.so.2605.0.0 /usr/lib64/libabsl_flags_commandlineflag_internal.so.2605.0.0 /usr/lib64/libabsl_log_initialize.so.2605.0.0 /usr/lib64/libabsl_log_internal_globals.so.2605.0.0 /usr/lib64/libabsl_log_globals.so.2605.0.0 /usr/lib64/libabsl_vlog_config_internal.so.2605.0.0 /usr/lib64/libabsl_log_internal_fnmatch.so.2605.0.0 /usr/lib64/libabsl_raw_hash_set.so.2605.0.0 /usr/lib64/libabsl_hashtablez_sampler.so.2605.0.0 /usr/lib64/libabsl_random_distributions.so.2605.0.0 /usr/lib64/libabsl_random_seed_sequences.so.2605.0.0 /usr/lib64/libabsl_random_internal_entropy_pool.so.2605.0.0 /usr/lib64/libabsl_random_internal_randen.so.2605.0.0 /usr/lib64/libabsl_random_internal_randen_hwaes.so.2605.0.0 /usr/lib64/libabsl_random_internal_randen_hwaes_impl.so.2605.0.0 /usr/lib64/libabsl_random_internal_ra
 nden_slow.so.2605.0.0 /usr/lib64/libabsl_random_internal_platform.so.2605.0.0 /usr/lib64/libabsl_random_internal_seed_material.so.2605.0.0 /usr/lib64/libabsl_random_seed_gen_exception.so.2605.0.0 /usr/lib64/libabsl_statusor.so.2605.0.0 /usr/lib64/libabsl_status.so.2605.0.0 /usr/lib64/libabsl_cord.so.2605.0.0 /usr/lib64/libabsl_cordz_info.so.2605.0.0 /usr/lib64/libabsl_cord_internal.so.2605.0.0 /usr/lib64/libabsl_hash.so.2605.0.0 /usr/lib64/libabsl_city.so.2605.0.0 /usr/lib64/libabsl_cordz_functions.so.2605.0.0 /usr/lib64/libabsl_exponential_biased.so.2605.0.0 /usr/lib64/libabsl_cordz_handle.so.2605.0.0 /usr/lib64/libabsl_crc_cord_state.so.2605.0.0 /usr/lib64/libabsl_crc32c.so.2605.0.0 /usr/lib64/libabsl_crc_internal.so.2605.0.0 /usr/lib64/libabsl_crc_cpu_detect.so.2605.0.0 /usr/lib64/libabsl_leak_check.so.2605.0.0 /usr/lib64/libabsl_strerror.so.2605.0.0 /usr/lib64/libabsl_str_format_internal.so.2605.0.0 /usr/lib64/libabsl_synchronization.so.2605.0.0 /usr/lib64/libabsl_stacktrace.so.
 2605.0.0 /usr/lib64/libabsl_symbolize.so.2605.0.0 /usr/lib64/libabsl_debugging_internal.so.2605.0.0 /usr/lib64/libabsl_demangle_internal.so.2605.0.0 /usr/lib64/libabsl_demangle_rust.so.2605.0.0 /usr/lib64/libabsl_decode_rust_punycode.so.2605.0.0 /usr/lib64/libabsl_utf8_for_code_point.so.2605.0.0 /usr/lib64/libabsl_graphcycles_internal.so.2605.0.0 /usr/lib64/libabsl_kernel_timeout_internal.so.2605.0.0 /usr/lib64/libabsl_malloc_internal.so.2605.0.0 /usr/lib64/libabsl_tracing_internal.so.2605.0.0 /usr/lib64/libabsl_time.so.2605.0.0 /usr/lib64/libabsl_civil_time.so.2605.0.0 /usr/lib64/libabsl_time_zone.so.2605.0.0 /usr/lib64/libabsl_strings.so.2605.0.0 /usr/lib64/libabsl_int128.so.2605.0.0 /usr/lib64/libabsl_source_location.so.2605.0.0 /usr/lib64/libabsl_strings_internal.so.2605.0.0 /usr/lib64/libabsl_base.so.2605.0.0 /usr/lib64/libabsl_spinlock_wait.so.2605.0.0 /usr/lib64/libabsl_throw_delegate.so.2605.0.0 /usr/lib64/libabsl_raw_logging_internal.so.2605.0.0 /usr/lib64/libabsl_log_sever
 ity.so.2605.0.0 liblib_prisma.a /usr/lib64/libboost_regex.so.1.86.0 /usr/lib64/librlottie.so.3.0.0 -Wl,--no-undefined /usr/lib64/libavfilter.so /usr/lib64/libtg_owt.a /usr/lib64/libpipewire-0.3.so /usr/lib64/libavcodec.so /usr/lib64/libavformat.so /usr/lib64/libavutil.so /usr/lib64/libswresample.so /usr/lib64/libswscale.so /usr/lib64/libopus.so /usr/lib64/libopenh264.so /usr/lib64/libssl.so /usr/lib64/libvpx.so /usr/lib64/libm.so /usr/lib64/libcrc32c.so.1.1.0 -lyuv /usr/lib64/libabsl_flags_parse.so.2605.0.0 /usr/lib64/libabsl_flags_usage.so.2605.0.0 /usr/lib64/libabsl_flags_usage_internal.so.2605.0.0 /usr/lib64/libabsl_flags_internal.so.2605.0.0 /usr/lib64/libabsl_flags_marshalling.so.2605.0.0 /usr/lib64/libabsl_flags_reflection.so.2605.0.0 /usr/lib64/libabsl_raw_hash_set.so.2605.0.0 /usr/lib64/libabsl_cord.so.2605.0.0 /usr/lib64/libabsl_cordz_info.so.2605.0.0 /usr/lib64/libabsl_cord_internal.so.2605.0.0 /usr/lib64/libabsl_cordz_functions.so.2605.0.0 /usr/lib64/libabsl_cordz_handle.
 so.2605.0.0 /usr/lib64/libabsl_crc_cord_state.so.2605.0.0 /usr/lib64/libabsl_crc32c.so.2605.0.0 /usr/lib64/libabsl_str_format_internal.so.2605.0.0 /usr/lib64/libabsl_crc_internal.so.2605.0.0 /usr/lib64/libabsl_crc_cpu_detect.so.2605.0.0 /usr/lib64/libabsl_hash.so.2605.0.0 /usr/lib64/libabsl_city.so.2605.0.0 /usr/lib64/libabsl_hashtablez_sampler.so.2605.0.0 /usr/lib64/libabsl_exponential_biased.so.2605.0.0 /usr/lib64/libabsl_flags_config.so.2605.0.0 /usr/lib64/libabsl_flags_private_handle_accessor.so.2605.0.0 /usr/lib64/libabsl_flags_commandlineflag.so.2605.0.0 /usr/lib64/libabsl_flags_commandlineflag_internal.so.2605.0.0 /usr/lib64/libabsl_flags_program_name.so.2605.0.0 /usr/lib64/libabsl_synchronization.so.2605.0.0 /usr/lib64/libabsl_graphcycles_internal.so.2605.0.0 /usr/lib64/libabsl_kernel_timeout_internal.so.2605.0.0 /usr/lib64/libabsl_stacktrace.so.2605.0.0 /usr/lib64/libabsl_symbolize.so.2605.0.0 /usr/lib64/libabsl_malloc_internal.so.2605.0.0 /usr/lib64/libabsl_debugging_inter
 nal.so.2605.0.0 /usr/lib64/libabsl_demangle_internal.so.2605.0.0 /usr/lib64/libabsl_demangle_rust.so.2605.0.0 /usr/lib64/libabsl_decode_rust_punycode.so.2605.0.0 /usr/lib64/libabsl_utf8_for_code_point.so.2605.0.0 /usr/lib64/libabsl_time.so.2605.0.0 /usr/lib64/libabsl_strings.so.2605.0.0 /usr/lib64/libabsl_strings_internal.so.2605.0.0 /usr/lib64/libabsl_throw_delegate.so.2605.0.0 /usr/lib64/libabsl_source_location.so.2605.0.0 /usr/lib64/libabsl_int128.so.2605.0.0 /usr/lib64/libabsl_civil_time.so.2605.0.0 /usr/lib64/libabsl_time_zone.so.2605.0.0 /usr/lib64/libabsl_tracing_internal.so.2605.0.0 /usr/lib64/libabsl_base.so.2605.0.0 /usr/lib64/libabsl_raw_logging_internal.so.2605.0.0 /usr/lib64/libabsl_log_severity.so.2605.0.0 /usr/lib64/libabsl_spinlock_wait.so.2605.0.0 /usr/lib64/libXcomposite.so /usr/lib64/libXdamage.so /usr/lib64/libXext.so /usr/lib64/libXfixes.so /usr/lib64/libXrandr.so /usr/lib64/libXrender.so /usr/lib64/libX11.so /usr/lib64/libXtst.so /usr/lib64/libXi.so lib_ui/libl
 ib_ui.a /usr/lib64/libjpeg.so /usr/lib64/liblz4.so lib_webview/liblib_webview_Webview_dbus.a /usr/lib64/libada.so.3.4.4 /usr/lib64/libz.so /usr/lib64/libtde2e.a /usr/lib64/libtdutils.a /usr/lib64/libcrypto.so /usr/lib64/libz./usr/bin/ld.bfd: liblib_tgcalls.a(ReflectorPort.cpp.o): in function `tgcalls::ReflectorPort::CreateReflectorClientSocket()':
[riscv64] ReflectorPort.cpp:(.text+0x20c2): undefined reference to `rtc::AsyncPacketSocket::RegisterReceivedPacketCallback(absl::lts_20260526::AnyInvocable<void (rtc::AsyncPacketSocket*, rtc::ReceivedPacket const&)>)'
[riscv64] /usr/bin/ld.bfd: relocation R_RISCV_CALL_PLT against `_ZN3rtc17AsyncPacketSocket30RegisterReceivedPacketCallbackEN4absl12lts_2026052612AnyInvocableIFvPS0_RKNS_14ReceivedPacketEEEE' which may bind externally can not be used when making a shared object; recompile with -fPIC
[riscv64] /usr/bin/ld.bfd: /usr/lib64/libtg_owt.a(media_session.cc.o): in function `std::char_traits<char>::length(char const*)':
[riscv64] /usr/include/c++/15/bits/char_traits.h:393:(.text+0x1ae): undefined reference to `absl::lts_20250127::EqualsIgnoreCase(std::basic_string_view<char, std::char_traits<char> >, std::basic_string_view<char, std::char_traits<char> >)'
[riscv64] /usr/bin/ld.bfd: relocation R_RISCV_CALL_PLT against `_ZN4absl12lts_2025012716EqualsIgnoreCaseESt17basic_string_viewIcSt11char_traitsIcEES4_' which may bind externally can not be used when making a shared object; recompile with -fPIC
[riscv64] /usr/bin/ld.bfd: /usr/lib64/libtg_owt.a(webrtc_video_engine.cc.o): in function `non-virtual thunk to cricket::WebRtcVideoReceiveChannel::OnPacketReceived(webrtc::RtpPacketReceived const&)':
[riscv64] /usr/src/RPM/BUILD/libowt-tg-4.3.0.15/src/media/engine/webrtc_video_engine.h:602:(.text+0x308a): undefined reference to `absl::lts_20250127::EqualsIgnoreCase(std::basic_string_view<char, std::char_traits<char> >, std::basic_string_view<char, std::char_traits<char> >)'
[riscv64] /usr/bin/ld.bfd: relocation R_RISCV_CALL_PLT against `_ZN4absl12lts_2025012716EqualsIgnoreCaseESt17basic_string_viewIcSt11char_traitsIcEES4_' which may bind externally can not be used when making a shared object; recompile with -fPIC
[riscv64] /usr/bin/ld.bfd: /usr/lib64/libtg_owt.a(webrtc_voice_engine.cc.o): in function `std::_Rb_tree<unsigned int, std::pair<unsigned int const, cricket::WebRtcVoiceSendChannel::WebRtcAudioSendStream*>, std::_Select1st<std::pair<unsigned int const, cricket::WebRtcVoiceSendChannel::WebRtcAudioSendStream*> >, std::less<unsigned int>, std::allocator<std::pair<unsigned int const, cricket::WebRtcVoiceSendChannel::WebRtcAudioSendStream*> > >::_M_lower_bound(std::_Rb_tree_node_base*, std::_Rb_tree_node_base*, unsigned int const&) const':
[riscv64] /usr/include/c++/15/bits/stl_tree.h:2603:(.text+0x6b78): undefined reference to `absl::lts_20250127::EqualsIgnoreCase(std::basic_string_view<char, std::char_traits<char> >, std::basic_string_view<char, std::char_traits<char> >)'
[riscv64] /usr/bin/ld.bfd: relocation R_RISCV_CALL_PLT against `_ZN4absl12lts_2025012716EqualsIgnoreCaseESt17basic_string_viewIcSt11char_traitsIcEES4_' which may bind externally can not be used when making a shared object; recompile with -fPIC
[riscv64] /usr/bin/ld.bfd: /usr/lib64/libtg_owt.a(peer_connection.cc.o): in function `webrtc::PeerConnection::ReportFirstConnectUsageMetrics()':
[riscv64] /usr/include/c++/15/bits/stl_algobase.h:2095:(.text+0x5f46): undefined reference to `absl::lts_20250127::EqualsIgnoreCase(std::basic_string_view<char, std::char_traits<char> >, std::basic_string_view<char, std::char_traits<char> >)'
[riscv64] /usr/bin/ld.bfd: relocation R_RISCV_CALL_PLT against `_ZN4absl12lts_2025012716EqualsIgnoreCaseESt17basic_string_viewIcSt11char_traitsIcEES4_' which may bind externally can not be used when making a shared object; recompile with -fPIC
[riscv64] /usr/bin/ld.bfd: /usr/lib64/libtg_owt.a(audio_decoder_L16.cc.o): in function `webrtc::AudioDecoderL16::SdpToConfig(webrtc::SdpAudioFormat const&)':
[riscv64] /usr/src/RPM/BUILD/libowt-tg-4.3.0.15/src/api/audio_codecs/L16/audio_decoder_L16.cc:27:(.text+0x30): undefined reference to `absl::lts_20250127::EqualsIgnoreCase(std::basic_string_view<char, std::char_traits<char> >, std::basic_string_view<char, std::char_traits<char> >)'
[riscv64] /usr/bin/ld.bfd: relocation R_RISCV_CALL_PLT against `_ZN4absl12lts_2025012716EqualsIgnoreCaseESt17basic_string_viewIcSt11char_traitsIcEES4_' which may bind externally can not be used when making a shared object; recompile with -fPIC
[riscv64] /usr/bin/ld.bfd: /usr/lib64/libtg_owt.a(audio_encoder_L16.cc.o):/usr/src/RPM/BUILD/libowt-tg-4.3.0.15/src/api/audio_codecs/L16/audio_encoder_L16.cc:40: more undefined references to `absl::lts_20250127::EqualsIgnoreCase(std::basic_string_view<char, std::char_traits<char> >, std::basic_string_view<char, std::char_traits<char> >)' follow
[riscv64] /usr/bin/ld.bfd: relocation R_RISCV_CALL_PLT against `_ZN4absl12lts_2025012716EqualsIgnoreCaseESt17basic_string_viewIcSt11char_traitsIcEES4_' which may bind externally can not be used when making a shared object; recompile with -fPIC
[riscv64] /usr/bin/ld.bfd: /usr/lib64/libtg_owt.a(webrtc_sdp.cc.o): in function `absl::lts_20250127::ascii_isspace(unsigned char)':
[riscv64] /usr/src/RPM/BUILD/libowt-tg-4.3.0.15/src/pc/webrtc_sdp.cc:2848:(.text._ZN4absl12lts_2025012713ascii_isspaceEh[_ZN4absl12lts_2025012713ascii_isspaceEh]+0x0): undefined reference to `absl::lts_20250127::ascii_internal::kPropertyBits'
[riscv64] /usr/bin/ld.bfd: /usr/lib64/libtg_owt.a(codec.cc.o): in function `cricket::FeedbackParam::operator==(cricket::FeedbackParam const&) const':
[riscv64] /usr/src/RPM/BUILD/libowt-tg-4.3.0.15/src/media/base/codec.cc:98:(.text+0x1b4): undefined reference to `absl::lts_20250127::EqualsIgnoreCase(std::basic_string_view<char, std::char_traits<char> >, std::basic_string_view<char, std::char_traits<char> >)'
[riscv64] /usr/bin/ld.bfd: relocation R_RISCV_CALL_PLT against `_ZN4absl12lts_2025012716EqualsIgnoreCaseESt17basic_string_viewIcSt11char_traitsIcEES4_' which may bind externally can not be used when making a shared object; recompile with -fPIC
[riscv64] /usr/bin/ld.bfd: /usr/lib64/libtg_owt.a(internal_decoder_factory.cc.o): in function `std::char_traits<char>::length(char const*)':
[riscv64] /usr/include/c++/15/bits/char_traits.h:393:(.text+0x17c): undefined reference to `absl::lts_20250127::EqualsIgnoreCase(std::basic_string_view<char, std::char_traits<char> >, std::basic_string_view<char, std::char_traits<char> >)'
[riscv64] /usr/bin/ld.bfd: relocation R_RISCV_CALL_PLT against `_ZN4absl12lts_2025012716EqualsIgnoreCaseESt17basic_string_viewIcSt11char_traitsIcEES4_' which may bind externally can not be used when making a shared object; recompile with -fPIC
2026-Jul-11 11:05:02 :: [riscv64] telegram-desktop-6.8.2-alt1.src.rpm: remote: build failed
2026-Jul-11 11:05:02 :: [riscv64] #4000 telegram-desktop-6.8.2-alt1.src.rpm: build FAILED
2026-Jul-11 11:05:02 :: [riscv64] #4000 telegram-desktop-6.8.2-alt1.src.rpm:: KEEP_GOING cheat activated, moving on
2026-Jul-11 11:05:02 :: [riscv64] #4100 warzone2100-4.7.0-alt2.src.rpm: build start
2026-Jul-11 11:06:17 :: [riscv64] #4100 warzone2100-4.7.0-alt2.src.rpm: build swiftly SKIPPED
2026-Jul-11 11:06:17 :: [riscv64] #4200 libopencv-4.13.0-alt1.src.rpm: build start
2026-Jul-11 13:21:50 :: [riscv64] #4200 libopencv-4.13.0-alt1.src.rpm: build OK
2026-Jul-11 13:21:50 :: [riscv64] #4300 ayugram-desktop-6.3.10-alt1.src.rpm: build start
[riscv64] /usr/bin/ld.bfd: /usr/src/tmp/ccNuriVe.ltrans122.ltrans.o: in function `tgcalls::ContentNegotiationContext::addOutgoingChannel[abi:cxx11](tgcalls::signaling::MediaContent::Type)':
[riscv64] <artificial>:(.text+0x487b8): undefined reference to `rtc::AsyncPacketSocket::RegisterReceivedPacketCallback(absl::lts_20260526::AnyInvocable<void (rtc::AsyncPacketSocket*, rtc::ReceivedPacket const&)>)'
[riscv64] /usr/bin/ld.bfd: relocation R_RISCV_CALL_PLT against `_ZN3rtc17AsyncPacketSocket30RegisterReceivedPacketCallbackEN4absl12lts_2026052612AnyInvocableIFvPS0_RKNS_14ReceivedPacketEEEE' which may bind externally can not be used when making a shared object; recompile with -fPIC
[riscv64] /usr/bin/ld.bfd: /usr/lib64/libtg_owt.a(media_session.cc.o): in function `std::char_traits<char>::length(char const*)':
[riscv64] /usr/include/c++/15/bits/char_traits.h:393:(.text+0x1ae): undefined reference to `absl::lts_20250127::EqualsIgnoreCase(std::basic_string_view<char, std::char_traits<char> >, std::basic_string_view<char, std::char_traits<char> >)'
[riscv64] /usr/bin/ld.bfd: relocation R_RISCV_CALL_PLT against `_ZN4absl12lts_2025012716EqualsIgnoreCaseESt17basic_string_viewIcSt11char_traitsIcEES4_' which may bind externally can not be used when making a shared object; recompile with -fPIC
[riscv64] /usr/bin/ld.bfd: /usr/lib64/libtg_owt.a(webrtc_video_engine.cc.o): in function `non-virtual thunk to cricket::WebRtcVideoReceiveChannel::OnPacketReceived(webrtc::RtpPacketReceived const&)':
[riscv64] /usr/src/RPM/BUILD/libowt-tg-4.3.0.15/src/media/engine/webrtc_video_engine.h:602:(.text+0x308a): undefined reference to `absl::lts_20250127::EqualsIgnoreCase(std::basic_string_view<char, std::char_traits<char> >, std::basic_string_view<char, std::char_traits<char> >)'
[riscv64] /usr/bin/ld.bfd: relocation R_RISCV_CALL_PLT against `_ZN4absl12lts_2025012716EqualsIgnoreCaseESt17basic_string_viewIcSt11char_traitsIcEES4_' which may bind externally can not be used when making a shared object; recompile with -fPIC
[riscv64] /usr/bin/ld.bfd: /usr/lib64/libtg_owt.a(webrtc_voice_engine.cc.o): in function `std::_Rb_tree<unsigned int, std::pair<unsigned int const, cricket::WebRtcVoiceSendChannel::WebRtcAudioSendStream*>, std::_Select1st<std::pair<unsigned int const, cricket::WebRtcVoiceSendChannel::WebRtcAudioSendStream*> >, std::less<unsigned int>, std::allocator<std::pair<unsigned int const, cricket::WebRtcVoiceSendChannel::WebRtcAudioSendStream*> > >::_M_lower_bound(std::_Rb_tree_node_base*, std::_Rb_tree_node_base*, unsigned int const&) const':
[riscv64] /usr/include/c++/15/bits/stl_tree.h:2603:(.text+0x6b78): undefined reference to `absl::lts_20250127::EqualsIgnoreCase(std::basic_string_view<char, std::char_traits<char> >, std::basic_string_view<char, std::char_traits<char> >)'
[riscv64] /usr/bin/ld.bfd: relocation R_RISCV_CALL_PLT against `_ZN4absl12lts_2025012716EqualsIgnoreCaseESt17basic_string_viewIcSt11char_traitsIcEES4_' which may bind externally can not be used when making a shared object; recompile with -fPIC
[riscv64] /usr/bin/ld.bfd: /usr/lib64/libtg_owt.a(peer_connection.cc.o): in function `webrtc::PeerConnection::ReportFirstConnectUsageMetrics()':
[riscv64] /usr/include/c++/15/bits/stl_algobase.h:2095:(.text+0x5f46): undefined reference to `absl::lts_20250127::EqualsIgnoreCase(std::basic_string_view<char, std::char_traits<char> >, std::basic_string_view<char, std::char_traits<char> >)'
[riscv64] /usr/bin/ld.bfd: relocation R_RISCV_CALL_PLT against `_ZN4absl12lts_2025012716EqualsIgnoreCaseESt17basic_string_viewIcSt11char_traitsIcEES4_' which may bind externally can not be used when making a shared object; recompile with -fPIC
[riscv64] /usr/bin/ld.bfd: /usr/lib64/libtg_owt.a(audio_decoder_L16.cc.o): in function `webrtc::AudioDecoderL16::SdpToConfig(webrtc::SdpAudioFormat const&)':
[riscv64] /usr/src/RPM/BUILD/libowt-tg-4.3.0.15/src/api/audio_codecs/L16/audio_decoder_L16.cc:27:(.text+0x30): undefined reference to `absl::lts_20250127::EqualsIgnoreCase(std::basic_string_view<char, std::char_traits<char> >, std::basic_string_view<char, std::char_traits<char> >)'
[riscv64] /usr/bin/ld.bfd: relocation R_RISCV_CALL_PLT against `_ZN4absl12lts_2025012716EqualsIgnoreCaseESt17basic_string_viewIcSt11char_traitsIcEES4_' which may bind externally can not be used when making a shared object; recompile with -fPIC
[riscv64] /usr/bin/ld.bfd: /usr/lib64/libtg_owt.a(audio_encoder_L16.cc.o):/usr/src/RPM/BUILD/libowt-tg-4.3.0.15/src/api/audio_codecs/L16/audio_encoder_L16.cc:40: more undefined references to `absl::lts_20250127::EqualsIgnoreCase(std::basic_string_view<char, std::char_traits<char> >, std::basic_string_view<char, std::char_traits<char> >)' follow
[riscv64] /usr/bin/ld.bfd: relocation R_RISCV_CALL_PLT against `_ZN4absl12lts_2025012716EqualsIgnoreCaseESt17basic_string_viewIcSt11char_traitsIcEES4_' which may bind externally can not be used when making a shared object; recompile with -fPIC
[riscv64] /usr/bin/ld.bfd: /usr/lib64/libtg_owt.a(webrtc_sdp.cc.o): in function `absl::lts_20250127::ascii_isspace(unsigned char)':
[riscv64] /usr/src/RPM/BUILD/libowt-tg-4.3.0.15/src/pc/webrtc_sdp.cc:2848:(.text._ZN4absl12lts_2025012713ascii_isspaceEh[_ZN4absl12lts_2025012713ascii_isspaceEh]+0x0): undefined reference to `absl::lts_20250127::ascii_internal::kPropertyBits'
[riscv64] /usr/bin/ld.bfd: /usr/lib64/libtg_owt.a(codec.cc.o): in function `cricket::FeedbackParam::operator==(cricket::FeedbackParam const&) const':
[riscv64] /usr/src/RPM/BUILD/libowt-tg-4.3.0.15/src/media/base/codec.cc:98:(.text+0x1b4): undefined reference to `absl::lts_20250127::EqualsIgnoreCase(std::basic_string_view<char, std::char_traits<char> >, std::basic_string_view<char, std::char_traits<char> >)'
[riscv64] /usr/bin/ld.bfd: relocation R_RISCV_CALL_PLT against `_ZN4absl12lts_2025012716EqualsIgnoreCaseESt17basic_string_viewIcSt11char_traitsIcEES4_' which may bind externally can not be used when making a shared object; recompile with -fPIC
[riscv64] /usr/bin/ld.bfd: /usr/lib64/libtg_owt.a(internal_decoder_factory.cc.o): in function `std::char_traits<char>::length(char const*)':
[riscv64] /usr/include/c++/15/bits/char_traits.h:393:(.text+0x17c): undefined reference to `absl::lts_20250127::EqualsIgnoreCase(std::basic_string_view<char, std::char_traits<char> >, std::basic_string_view<char, std::char_traits<char> >)'
[riscv64] /usr/bin/ld.bfd: relocation R_RISCV_CALL_PLT against `_ZN4absl12lts_2025012716EqualsIgnoreCaseESt17basic_string_viewIcSt11char_traitsIcEES4_' which may bind externally can not be used when making a shared object; recompile with -fPIC
2026-Jul-11 16:27:04 :: [riscv64] ayugram-desktop-6.3.10-alt1.src.rpm: remote: build failed
2026-Jul-11 16:27:04 :: [riscv64] #4300 ayugram-desktop-6.3.10-alt1.src.rpm: build FAILED
2026-Jul-11 16:27:04 :: [riscv64] #4300 ayugram-desktop-6.3.10-alt1.src.rpm:: KEEP_GOING cheat activated, moving on
2026-Jul-11 16:27:05 :: [riscv64] #4400 osgearth-3.8.1-alt1.src.rpm: build start
2026-Jul-11 16:50:02 :: [riscv64] #4400 osgearth-3.8.1-alt1.src.rpm: build OK
2026-Jul-11 16:50:02 :: [riscv64] #4500 libvalhalla-3.5.1-alt1.src.rpm: build start
2026-Jul-11 17:05:53 :: [riscv64] #4500 libvalhalla-3.5.1-alt1.src.rpm: build OK
2026-Jul-11 17:05:53 :: [riscv64] #4600 mixxx-2.5.6-alt1.src.rpm: build start
2026-Jul-11 17:52:07 :: [riscv64] #4600 mixxx-2.5.6-alt1.src.rpm: build OK
2026-Jul-11 17:52:07 :: [riscv64] #4700 grpc1.70-1.70.1-alt2.src.rpm: build start
2026-Jul-11 18:13:07 :: [riscv64] #4700 grpc1.70-1.70.1-alt2.src.rpm: build OK
2026-Jul-11 18:13:07 :: [riscv64] #5000 ncnn.git 20260113-alt0.port: build start
2026-Jul-11 18:30:18 :: [riscv64] #5000 ncnn.git 20260113-alt0.port: build OK
2026-Jul-11 18:30:18 :: [riscv64] #5100 libopenshot-0.6.0-alt1.src.rpm: build start
2026-Jul-11 18:45:35 :: [riscv64] #5100 libopenshot-0.6.0-alt1.src.rpm: build OK
2026-Jul-11 18:45:35 :: [riscv64] #5200 kicad-10.0.4-alt1.src.rpm: build start
2026-Jul-11 20:36:31 :: [riscv64] #5200 kicad-10.0.4-alt1.src.rpm: build OK
2026-Jul-11 20:36:31 :: [riscv64] #5300 PokerTH-2.0.7-alt1.src.rpm: build start
2026-Jul-11 20:52:48 :: [riscv64] #5300 PokerTH-2.0.7-alt1.src.rpm: build OK
2026-Jul-11 20:52:48 :: [riscv64] #5400 mumble-1.4.287-alt2.4.src.rpm: build start
2026-Jul-11 21:05:29 :: [riscv64] #5400 mumble-1.4.287-alt2.4.src.rpm: build OK
2026-Jul-11 21:05:29 :: [riscv64] #5500 osmscout-server-3.1.5-alt2.src.rpm: build start
2026-Jul-11 21:25:19 :: [riscv64] #5500 osmscout-server-3.1.5-alt2.src.rpm: build OK
2026-Jul-11 21:25:19 :: [riscv64] #5600 marble-26.04.2-alt1.src.rpm: build start
2026-Jul-11 22:21:05 :: [riscv64] #5600 marble-26.04.2-alt1.src.rpm: build OK
2026-Jul-11 22:21:06 :: [riscv64] #5700 merkaartor-0.20.0-alt1.src.rpm: build start
2026-Jul-11 22:30:58 :: [riscv64] #5700 merkaartor-0.20.0-alt1.src.rpm: build OK
2026-Jul-11 22:31:01 :: 200: build check OK
2026-Jul-11 22:31:02 :: 300: build check OK
2026-Jul-11 22:31:03 :: 400: build check OK
2026-Jul-11 22:31:04 :: 500: build check OK
2026-Jul-11 22:31:05 :: 600: build check OK
2026-Jul-11 22:31:06 :: 700: build check OK
2026-Jul-11 22:31:07 :: 1000: build check OK
2026-Jul-11 22:31:09 :: 1100: build check OK
2026-Jul-11 22:31:10 :: 1200: build check OK
2026-Jul-11 22:31:11 :: 1300: build check OK
2026-Jul-11 22:31:12 :: 1400: build check OK
2026-Jul-11 22:31:12 :: 1500: build check OK
2026-Jul-11 22:31:14 :: 1600: build check OK
2026-Jul-11 22:31:15 :: 1700: build check OK
2026-Jul-11 22:31:16 :: 2000: build check OK
2026-Jul-11 22:31:17 :: 2100: build check OK
find: 'riscv64/srpm/': No such file or directory
2026-Jul-11 22:31:18 :: 2300: build check OK
2026-Jul-11 22:31:18 :: 2400: build check OK
2026-Jul-11 22:31:19 :: 2500: build check OK
2026-Jul-11 22:31:22 :: 2600: build check OK
2026-Jul-11 22:31:22 :: 2700: build check OK
2026-Jul-11 22:31:23 :: 3000: build check OK
2026-Jul-11 22:31:23 :: 3100: build check OK
2026-Jul-11 22:31:25 :: 3200: build check OK
2026-Jul-11 22:31:25 :: 3300: build check OK
find: 'riscv64/srpm/': No such file or directory
find: 'riscv64/srpm/': No such file or directory
2026-Jul-11 22:31:27 :: 3600: build check OK
2026-Jul-11 22:31:43 :: 3700: build check OK
find: 'riscv64/srpm/': No such file or directory
2026-Jul-11 22:31:47 :: 4100: build check OK
2026-Jul-11 22:31:55 :: 4200: build check OK
find: 'riscv64/srpm/': No such file or directory
riscv64/srpm/osgearth-3.8.1-alt1.src.rpm: exception not found in '/usr/share/license-exception' directory: exceptions
riscv64/rpms/libosgearth-3.8.1-alt1.riscv64.rpm: exception not found in '/usr/share/license-exception' directory: exceptions
riscv64/rpms/libosgearth-debuginfo-3.8.1-alt1.riscv64.rpm: exception not found in '/usr/share/license-exception' directory: exceptions
riscv64/rpms/osgearth-data-3.8.1-alt1.noarch.rpm: exception not found in '/usr/share/license-exception' directory: exceptions
riscv64/rpms/osgearth-examples-debuginfo-3.8.1-alt1.riscv64.rpm: exception not found in '/usr/share/license-exception' directory: exceptions
riscv64/rpms/libosgearth-devel-3.8.1-alt1.riscv64.rpm: exception not found in '/usr/share/license-exception' directory: exceptions
riscv64/rpms/osgearth-examples-3.8.1-alt1.riscv64.rpm: exception not found in '/usr/share/license-exception' directory: exceptions
2026-Jul-11 22:31:57 :: 4400: build check OK
2026-Jul-11 22:31:58 :: 4500: build check OK
2026-Jul-11 22:31:59 :: 4600: build check OK
2026-Jul-11 22:32:00 :: 4700: build check OK
2026-Jul-11 22:32:01 :: 5000: build check OK
2026-Jul-11 22:32:02 :: 5100: build check OK
2026-Jul-11 22:32:04 :: 5200: build check OK
2026-Jul-11 22:32:05 :: 5300: build check OK
2026-Jul-11 22:32:06 :: 5400: build check OK
2026-Jul-11 22:32:07 :: 5500: build check OK
2026-Jul-11 22:32:09 :: 5600: build check OK
2026-Jul-11 22:32:09 :: 5700: build check OK
2026-Jul-11 22:32:10 :: build check FAILED for: #2200 #3400 #3500 #4000 #4300 
2026-Jul-11 22:32:10 :: task #132241 for sisyphus_riscv64 FAILED


More information about the Riscv-reports mailing list