[riscv-reports] [#132313] sisyphus_riscv64 FAILED srpm=nanoflann-1.10.1.4.1-alt0.1.src.rpm

Girar sisyphus_riscv64 awaiter recycler noreply at basealt.ru
Fri Jul 10 21:32:14 MSK 2026


http://web.build.srt.basealt.ru/tasks/132313/logs/events.1.1.log

subtask  name       riscv64
   #100  nanoflann   failed

2026-Jul-10 18:29:54 :: shared task #132313 for sisyphus_riscv64 started by recycler:
2026-Jul-10 18:29:54 :: message: sync
#100 build nanoflann-1.10.1.4.1-alt0.1.src.rpm
2026-Jul-10 18:30:00 :: [riscv64] #100 nanoflann-1.10.1.4.1-alt0.1.src.rpm: build start
[riscv64] cd /usr/src/RPM/BUILD/nanoflann-1.10.1.4.1/riscv64-alt-linux/examples && /usr/bin/c++ -DNANOFLANN_PATH=\"/usr/src/RPM/BUILD/nanoflann-1.10.1.4.1\" -I/usr/src/RPM/BUILD/nanoflann-1.10.1.4.1/include -pipe -frecord-gcc-switches -Wall -g -O2 -flto=auto -O2 -g -DNDEBUG -Wall -Wshadow -Wno-long-long -Wno-variadic-macros -O2 -mtune=native -Wno-ignored-attributes -Wno-int-in-bool-context -Wextra -Wpedantic -Wconversion -MD -MT examples/CMakeFiles/dynamic_pointcloud_example.dir/dynamic_pointcloud_example.cpp.o -MF CMakeFiles/dynamic_pointcloud_example.dir/dynamic_pointcloud_example.cpp.o.d -o CMakeFiles/dynamic_pointcloud_example.dir/dynamic_pointcloud_example.cpp.o -c /usr/src/RPM/BUILD/nanoflann-1.10.1.4.1/examples/dynamic_pointcloud_example.cpp
[riscv64] cc1plus: error: unknown cpu 'native' for '-mtune'
[riscv64] gmake[2]: *** [examples/CMakeFiles/dynamic_pointcloud_example.dir/build.make:79: examples/CMakeFiles/dynamic_pointcloud_example.dir/dynamic_pointcloud_example.cpp.o] Error 1
[riscv64] --
[riscv64] cd /usr/src/RPM/BUILD/nanoflann-1.10.1.4.1/riscv64-alt-linux/examples && /usr/bin/c++ -DNANOFLANN_PATH=\"/usr/src/RPM/BUILD/nanoflann-1.10.1.4.1\" -I/usr/src/RPM/BUILD/nanoflann-1.10.1.4.1/include -pipe -frecord-gcc-switches -Wall -g -O2 -flto=auto -O2 -g -DNDEBUG -Wall -Wshadow -Wno-long-long -Wno-variadic-macros -O2 -mtune=native -Wno-ignored-attributes -Wno-int-in-bool-context -Wextra -Wpedantic -Wconversion -MD -MT examples/CMakeFiles/pointcloud_kdd_radius.dir/pointcloud_kdd_radius.cpp.o -MF CMakeFiles/pointcloud_kdd_radius.dir/pointcloud_kdd_radius.cpp.o.d -o CMakeFiles/pointcloud_kdd_radius.dir/pointcloud_kdd_radius.cpp.o -c /usr/src/RPM/BUILD/nanoflann-1.10.1.4.1/examples/pointcloud_kdd_radius.cpp
[riscv64] cc1plus: error: unknown cpu 'native' for '-mtune'
[riscv64] gmake[2]: *** [examples/CMakeFiles/pointcloud_kdd_radius.dir/build.make:79: examples/CMakeFiles/pointcloud_kdd_radius.dir/pointcloud_kdd_radius.cpp.o] Error 1
[riscv64] --
[riscv64] cd /usr/src/RPM/BUILD/nanoflann-1.10.1.4.1/riscv64-alt-linux/examples && /usr/bin/c++ -DNANOFLANN_PATH=\"/usr/src/RPM/BUILD/nanoflann-1.10.1.4.1\" -I/usr/src/RPM/BUILD/nanoflann-1.10.1.4.1/include -pipe -frecord-gcc-switches -Wall -g -O2 -flto=auto -O2 -g -DNDEBUG -Wall -Wshadow -Wno-long-long -Wno-variadic-macros -O2 -mtune=native -Wno-ignored-attributes -Wno-int-in-bool-context -Wextra -Wpedantic -Wconversion -MD -MT examples/CMakeFiles/pointcloud_custom_resultset.dir/pointcloud_custom_resultset.cpp.o -MF CMakeFiles/pointcloud_custom_resultset.dir/pointcloud_custom_resultset.cpp.o.d -o CMakeFiles/pointcloud_custom_resultset.dir/pointcloud_custom_resultset.cpp.o -c /usr/src/RPM/BUILD/nanoflann-1.10.1.4.1/examples/pointcloud_custom_resultset.cpp
[riscv64] cc1plus: error: unknown cpu 'native' for '-mtune'
[riscv64] gmake[2]: *** [examples/CMakeFiles/pointcloud_custom_resultset.dir/build.make:79: examples/CMakeFiles/pointcloud_custom_resultset.dir/pointcloud_custom_resultset.cpp.o] Error 1
[riscv64] --
[riscv64] cd /usr/src/RPM/BUILD/nanoflann-1.10.1.4.1/riscv64-alt-linux/examples && /usr/bin/c++ -DNANOFLANN_PATH=\"/usr/src/RPM/BUILD/nanoflann-1.10.1.4.1\" -I/usr/src/RPM/BUILD/nanoflann-1.10.1.4.1/include -pipe -frecord-gcc-switches -Wall -g -O2 -flto=auto -O2 -g -DNDEBUG -Wall -Wshadow -Wno-long-long -Wno-variadic-macros -O2 -mtune=native -Wno-ignored-attributes -Wno-int-in-bool-context -Wextra -Wpedantic -Wconversion -MD -MT examples/CMakeFiles/pointcloud_example.dir/pointcloud_example.cpp.o -MF CMakeFiles/pointcloud_example.dir/pointcloud_example.cpp.o.d -o CMakeFiles/pointcloud_example.dir/pointcloud_example.cpp.o -c /usr/src/RPM/BUILD/nanoflann-1.10.1.4.1/examples/pointcloud_example.cpp
[riscv64] cc1plus: error: unknown cpu 'native' for '-mtune'
[riscv64] gmake[2]: *** [examples/CMakeFiles/pointcloud_example.dir/build.make:79: examples/CMakeFiles/pointcloud_example.dir/pointcloud_example.cpp.o] Error 1
[riscv64] --
[riscv64] cd /usr/src/RPM/BUILD/nanoflann-1.10.1.4.1/riscv64-alt-linux/examples && /usr/bin/c++ -DNANOFLANN_PATH=\"/usr/src/RPM/BUILD/nanoflann-1.10.1.4.1\" -I/usr/src/RPM/BUILD/nanoflann-1.10.1.4.1/include -pipe -frecord-gcc-switches -Wall -g -O2 -flto=auto -O2 -g -DNDEBUG -Wall -Wshadow -Wno-long-long -Wno-variadic-macros -O2 -mtune=native -Wno-ignored-attributes -Wno-int-in-bool-context -Wextra -Wpedantic -Wconversion -MD -MT examples/CMakeFiles/pointcloud_adaptor_example.dir/pointcloud_adaptor_example.cpp.o -MF CMakeFiles/pointcloud_adaptor_example.dir/pointcloud_adaptor_example.cpp.o.d -o CMakeFiles/pointcloud_adaptor_example.dir/pointcloud_adaptor_example.cpp.o -c /usr/src/RPM/BUILD/nanoflann-1.10.1.4.1/examples/pointcloud_adaptor_example.cpp
[riscv64] cc1plus: error: unknown cpu 'native' for '-mtune'
[riscv64] gmake[2]: *** [examples/CMakeFiles/pointcloud_adaptor_example.dir/build.make:79: examples/CMakeFiles/pointcloud_adaptor_example.dir/pointcloud_adaptor_example.cpp.o] Error 1
[riscv64] --
[riscv64] cd /usr/src/RPM/BUILD/nanoflann-1.10.1.4.1/riscv64-alt-linux/examples && /usr/bin/c++ -DNANOFLANN_PATH=\"/usr/src/RPM/BUILD/nanoflann-1.10.1.4.1\" -I/usr/src/RPM/BUILD/nanoflann-1.10.1.4.1/include -pipe -frecord-gcc-switches -Wall -g -O2 -flto=auto -O2 -g -DNDEBUG -Wall -Wshadow -Wno-long-long -Wno-variadic-macros -O2 -mtune=native -Wno-ignored-attributes -Wno-int-in-bool-context -Wextra -Wpedantic -Wconversion -MD -MT examples/CMakeFiles/pointcloud_custom_metric.dir/pointcloud_custom_metric.cpp.o -MF CMakeFiles/pointcloud_custom_metric.dir/pointcloud_custom_metric.cpp.o.d -o CMakeFiles/pointcloud_custom_metric.dir/pointcloud_custom_metric.cpp.o -c /usr/src/RPM/BUILD/nanoflann-1.10.1.4.1/examples/pointcloud_custom_metric.cpp
[riscv64] cc1plus: error: unknown cpu 'native' for '-mtune'
[riscv64] gmake[2]: *** [examples/CMakeFiles/pointcloud_custom_metric.dir/build.make:79: examples/CMakeFiles/pointcloud_custom_metric.dir/pointcloud_custom_metric.cpp.o] Error 1
[riscv64] --
[riscv64] cd /usr/src/RPM/BUILD/nanoflann-1.10.1.4.1/riscv64-alt-linux/examples && /usr/bin/c++ -DNANOFLANN_PATH=\"/usr/src/RPM/BUILD/nanoflann-1.10.1.4.1\" -I/usr/src/RPM/BUILD/nanoflann-1.10.1.4.1/include -pipe -frecord-gcc-switches -Wall -g -O2 -flto=auto -O2 -g -DNDEBUG -Wall -Wshadow -Wno-long-long -Wno-variadic-macros -O2 -mtune=native -Wno-ignored-attributes -Wno-int-in-bool-context -Wextra -Wpedantic -Wconversion -MD -MT examples/CMakeFiles/vector_of_vectors_example.dir/vector_of_vectors_example.cpp.o -MF CMakeFiles/vector_of_vectors_example.dir/vector_of_vectors_example.cpp.o.d -o CMakeFiles/vector_of_vectors_example.dir/vector_of_vectors_example.cpp.o -c /usr/src/RPM/BUILD/nanoflann-1.10.1.4.1/examples/vector_of_vectors_example.cpp
[riscv64] cc1plus: error: unknown cpu 'native' for '-mtune'
[riscv64] gmake[2]: *** [examples/CMakeFiles/vector_of_vectors_example.dir/build.make:79: examples/CMakeFiles/vector_of_vectors_example.dir/vector_of_vectors_example.cpp.o] Error 1
[riscv64] --
[riscv64] cd /usr/src/RPM/BUILD/nanoflann-1.10.1.4.1/riscv64-alt-linux/examples && /usr/bin/c++ -DNANOFLANN_PATH=\"/usr/src/RPM/BUILD/nanoflann-1.10.1.4.1\" -I/usr/src/RPM/BUILD/nanoflann-1.10.1.4.1/include -pipe -frecord-gcc-switches -Wall -g -O2 -flto=auto -O2 -g -DNDEBUG -Wall -Wshadow -Wno-long-long -Wno-variadic-macros -O2 -mtune=native -Wno-ignored-attributes -Wno-int-in-bool-context -Wextra -Wpedantic -Wconversion -MD -MT examples/CMakeFiles/saveload_example.dir/saveload_example.cpp.o -MF CMakeFiles/saveload_example.dir/saveload_example.cpp.o.d -o CMakeFiles/saveload_example.dir/saveload_example.cpp.o -c /usr/src/RPM/BUILD/nanoflann-1.10.1.4.1/examples/saveload_example.cpp
[riscv64] cc1plus: error: unknown cpu 'native' for '-mtune'
[riscv64] gmake[2]: *** [examples/CMakeFiles/saveload_example.dir/build.make:79: examples/CMakeFiles/saveload_example.dir/saveload_example.cpp.o] Error 1
[riscv64] --
[riscv64] cd /usr/src/RPM/BUILD/nanoflann-1.10.1.4.1/riscv64-alt-linux/tests/gtest-1.8.0 && /usr/bin/c++ -DNANOFLANN_PATH=\"/usr/src/RPM/BUILD/nanoflann-1.10.1.4.1\" -I/usr/src/RPM/BUILD/nanoflann-1.10.1.4.1/tests/gtest-1.8.0/include -I/usr/src/RPM/BUILD/nanoflann-1.10.1.4.1/tests/gtest-1.8.0/. -pipe -frecord-gcc-switches -Wall -g -O2 -flto=auto -O2 -g -DNDEBUG -Wall -Wshadow -Wno-long-long -Wno-variadic-macros -O2 -mtune=native -Wno-ignored-attributes -Wno-int-in-bool-context -MD -MT tests/gtest-1.8.0/CMakeFiles/mygtest.dir/src/gtest-all.cc.o -MF CMakeFiles/mygtest.dir/src/gtest-all.cc.o.d -o CMakeFiles/mygtest.dir/src/gtest-all.cc.o -c /usr/src/RPM/BUILD/nanoflann-1.10.1.4.1/tests/gtest-1.8.0/src/gtest-all.cc
[riscv64] cc1plus: error: unknown cpu 'native' for '-mtune'
[riscv64] gmake[2]: *** [tests/gtest-1.8.0/CMakeFiles/mygtest.dir/build.make:79: tests/gtest-1.8.0/CMakeFiles/mygtest.dir/src/gtest-all.cc.o] Error 1
[riscv64] --
[riscv64] cd /usr/src/RPM/BUILD/nanoflann-1.10.1.4.1/riscv64-alt-linux/examples && /usr/bin/c++ -DNANOFLANN_PATH=\"/usr/src/RPM/BUILD/nanoflann-1.10.1.4.1\" -I/usr/src/RPM/BUILD/nanoflann-1.10.1.4.1/include -pipe -frecord-gcc-switches -Wall -g -O2 -flto=auto -O2 -g -DNDEBUG -Wall -Wshadow -Wno-long-long -Wno-variadic-macros -O2 -mtune=native -Wno-ignored-attributes -Wno-int-in-bool-context -Wextra -Wpedantic -Wconversion -MD -MT examples/CMakeFiles/SO2_adaptor_example.dir/SO2_adaptor_example.cpp.o -MF CMakeFiles/SO2_adaptor_example.dir/SO2_adaptor_example.cpp.o.d -o CMakeFiles/SO2_adaptor_example.dir/SO2_adaptor_example.cpp.o -c /usr/src/RPM/BUILD/nanoflann-1.10.1.4.1/examples/SO2_adaptor_example.cpp
[riscv64] cc1plus: error: unknown cpu 'native' for '-mtune'
[riscv64] gmake[2]: *** [examples/CMakeFiles/SO2_adaptor_example.dir/build.make:79: examples/CMakeFiles/SO2_adaptor_example.dir/SO2_adaptor_example.cpp.o] Error 1
2026-Jul-10 18:32:13 :: [riscv64] nanoflann-1.10.1.4.1-alt0.1.src.rpm: remote: build failed
2026-Jul-10 18:32:13 :: [riscv64] #100 nanoflann-1.10.1.4.1-alt0.1.src.rpm: build FAILED
2026-Jul-10 18:32:13 :: [riscv64] requesting cancellation of task processing
2026-Jul-10 18:32:14 :: [riscv64] build FAILED
2026-Jul-10 18:32:14 :: task #132313 for sisyphus_riscv64 FAILED


More information about the Riscv-reports mailing list