[riscv-reports] [#131953] sisyphus_riscv64 FAILED (try 3) srpm=grpc1.70-1.70.1-alt2.src.rpm srpm=protobuf25-3.25.5-alt9.src.rpm ...

Girar sisyphus_riscv64 awaiter iv noreply at basealt.ru
Thu Jul 9 10:25:40 MSK 2026


http://web.build.srt.basealt.ru/tasks/131953/logs/events.3.1.log

2026-Jul-09 07:21:35 :: task #131953 for sisyphus_riscv64 resumed by iv:
2026-Jul-09 07:21:35 :: message: protobuf_ftw
#100 build grpc1.70-1.70.1-alt2.src.rpm
#200 build protobuf25-3.25.5-alt9.src.rpm
#300 build libabseil-cpp2501.0.0-20250127.1-alt3.src.rpm
#340 build libabseil-cpp-20260526.0-alt1.src.rpm
#400 build protobuf-31.1-alt1.src.rpm
#500 build common-protos-ruby-20230122-alt2.src.rpm
#600 build grpc-1.80.0-alt1.src.rpm
#700 build apache-orc-2.3.0-alt1.src.rpm
#1000 build arrow-23.0.1-alt1.src.rpm
#1100 build MySQL-8.0.44-alt1.src.rpm
#1200 build ceph-19.2.3-alt3.src.rpm
#1300 removed
2026-Jul-09 07:21:35 :: created build repo
2026-Jul-09 07:21:40 :: [riscv64] #100 grpc1.70-1.70.1-alt2.src.rpm: build start
2026-Jul-09 07:21:45 :: [riscv64] #100 grpc1.70-1.70.1-alt2.src.rpm: build swiftly SKIPPED
2026-Jul-09 07:21:45 :: [riscv64] #200 protobuf25-3.25.5-alt9.src.rpm: build start
2026-Jul-09 07:21:49 :: [riscv64] #200 protobuf25-3.25.5-alt9.src.rpm: build swiftly SKIPPED
2026-Jul-09 07:21:49 :: [riscv64] #300 libabseil-cpp2501.0.0-20250127.1-alt3.src.rpm: build start
2026-Jul-09 07:21:51 :: [riscv64] #300 libabseil-cpp2501.0.0-20250127.1-alt3.src.rpm: build swiftly SKIPPED
2026-Jul-09 07:21:51 :: [riscv64] #340 libabseil-cpp-20260526.0-alt1.src.rpm: build start
2026-Jul-09 07:21:54 :: [riscv64] #340 libabseil-cpp-20260526.0-alt1.src.rpm: build swiftly SKIPPED
2026-Jul-09 07:21:54 :: [riscv64] #400 protobuf-31.1-alt1.src.rpm: build start
2026-Jul-09 07:21:58 :: [riscv64] #400 protobuf-31.1-alt1.src.rpm: build swiftly SKIPPED
2026-Jul-09 07:21:58 :: [riscv64] #500 common-protos-ruby-20230122-alt2.src.rpm: build start
2026-Jul-09 07:22:00 :: [riscv64] #500 common-protos-ruby-20230122-alt2.src.rpm: build swiftly SKIPPED
2026-Jul-09 07:22:00 :: [riscv64] #600 grpc-1.80.0-alt1.src.rpm: build start
2026-Jul-09 07:22:07 :: [riscv64] #600 grpc-1.80.0-alt1.src.rpm: build swiftly SKIPPED
2026-Jul-09 07:22:07 :: [riscv64] #700 apache-orc-2.3.0-alt1.src.rpm: build start
2026-Jul-09 07:22:11 :: [riscv64] #700 apache-orc-2.3.0-alt1.src.rpm: build swiftly SKIPPED
2026-Jul-09 07:22:11 :: [riscv64] #1000 arrow-23.0.1-alt1.src.rpm: build start
2026-Jul-09 07:22:16 :: [riscv64] #1000 arrow-23.0.1-alt1.src.rpm: build swiftly SKIPPED
2026-Jul-09 07:22:17 :: [riscv64] #1100 MySQL-8.0.44-alt1.src.rpm: build start
2026-Jul-09 07:22:42 :: [riscv64] #1100 MySQL-8.0.44-alt1.src.rpm: build swiftly SKIPPED
2026-Jul-09 07:22:42 :: [riscv64] #1200 ceph-19.2.3-alt3.src.rpm: build start
2026-Jul-09 07:23:33 :: [riscv64] #1200 ceph-19.2.3-alt3.src.rpm: build swiftly SKIPPED
2026-Jul-09 07:23:34 :: 100: build check OK
2026-Jul-09 07:23:35 :: 200: build check OK
2026-Jul-09 07:23:35 :: 300: build check OK
2026-Jul-09 07:23:36 :: 340: build check OK
2026-Jul-09 07:23:39 :: 400: build check OK
2026-Jul-09 07:23:42 :: 500: build check OK
2026-Jul-09 07:23:44 :: 600: build check OK
2026-Jul-09 07:23:45 :: 700: build check OK
2026-Jul-09 07:23:51 :: 1000: build check OK
riscv64/srpm/MySQL-8.0.44-alt1.src.rpm: exception not found in '/usr/share/license-exception' directory: exceptions
riscv64/rpms/libmysqlclient21-debuginfo-8.0.44-alt1.riscv64.rpm: exception not found in '/usr/share/license-exception' directory: exceptions
riscv64/rpms/MySQL-server-debuginfo-8.0.44-alt1.riscv64.rpm: exception not found in '/usr/share/license-exception' directory: exceptions
riscv64/rpms/MySQL-client-debuginfo-8.0.44-alt1.riscv64.rpm: exception not found in '/usr/share/license-exception' directory: exceptions
2026-Jul-09 07:23:54 :: 1100: build check OK
2026-Jul-09 07:24:05 :: 1200: build check OK
2026-Jul-09 07:24:06 :: build check OK
2026-Jul-09 07:24:06 :: #100: grpc1.70-1.70.1-alt2.src.rpm: version check OK
2026-Jul-09 07:24:06 :: #200: protobuf25-3.25.5-alt9.src.rpm: version check OK
2026-Jul-09 07:24:06 :: #300: libabseil-cpp2501.0.0-20250127.1-alt3.src.rpm: version check OK
2026-Jul-09 07:24:07 :: #340: libabseil-cpp-20260526.0-alt1.src.rpm: version check OK
2026-Jul-09 07:24:07 :: #400: protobuf-31.1-alt1.src.rpm: version check OK
2026-Jul-09 07:24:08 :: #500: common-protos-ruby-20230122-alt2.src.rpm: version check OK
2026-Jul-09 07:24:08 :: #600: grpc-1.80.0-alt1.src.rpm: version check OK
2026-Jul-09 07:24:08 :: #700: apache-orc-2.3.0-alt1.src.rpm: version check OK
2026-Jul-09 07:24:10 :: #1000: arrow-23.0.1-alt1.src.rpm: version check OK
2026-Jul-09 07:24:10 :: #1100: MySQL-8.0.44-alt1.src.rpm: version check OK
2026-Jul-09 07:24:12 :: #1200: ceph-19.2.3-alt3.src.rpm: version check OK
2026-Jul-09 07:24:12 :: build version check OK
2026-Jul-09 07:24:14 :: noarch check OK
2026-Jul-09 07:24:15 :: plan: src +11 -8 =21251, noarch +39 -39 =22053, riscv64 +154 -145 =37575
#700 apache-orc 2.1.3-alt1 -> 2.3.0-alt1
 Sat Apr 11 2026 Anton Farygin <rider at altlinux.ru> 2.3.0-alt1
 - updated from 2.1.3 to 2.3.0
#1000 arrow 12.0.0-alt2.6 -> 23.0.1-alt1
 Sun Apr 12 2026 Anton Farygin <rider at altlinux.org> 23.0.1-alt1
 - updated from 12.0.0 to 23.0.1
#1200 ceph 19.2.3-alt2.1 -> 19.2.3-alt3
 Sat Apr 25 2026 Anton Farygin <rider at altlinux.org> 19.2.3-alt3
 - fix build with gcc 15: backport upstream zpp_bits.h fixes
   (ceph commits 830925f0, 9b8d72f1, 3fcd3536)
 - updated BR (libgrpc++devel -> libgrpc-devel)
 - fix build against system Apache Arrow >= 20 (s3select parquet
   decryptor API, cherry-picked from ceph/s3select PR #169)
#500 common-protos-ruby 20230122-alt1 -> 20230122-alt2
 Thu Apr 30 2026 Anton Farygin <rider at altlinux.org> 20230122-alt2
 - drop upper bound on google-protobuf to allow building/installing
   with google-protobuf 4+
#600 grpc 1.70.1-alt1.1 -> 1.80.0-alt1
 Sun Apr 12 2026 Anton Farygin <rider at altlinux.org> 1.80.0-alt1
 - updated from 1.70.1 to 1.80.0
#340 libabseil-cpp 20250127.1-alt2 -> 20260526.0-alt1
 Fri Jun 26 2026 Anton Farygin <rider at altlinux.org> 20260526.0-alt1
 - 20260107.1 -> 20260526.0
 Wed Apr 08 2026 Anton Farygin <rider at altlinux.org> 20260107.1-alt1
 - 20250127.1 -> 20260107.1
#400 protobuf 3.25.5-alt7 -> 31.1-alt1
 Sun Apr 12 2026 Anton Farygin <rider at altlinux.org> 31.1-alt1
 - major update from 3.25.5 to 31.1 with new libabseil-cpp
 Fri Feb 27 2026 Evgeniy Serov <scala at altlinux.org> 3.25.5-alt8
 - Fixed build with new guava.
2026-Jul-09 07:25:02 :: patched apt indices
2026-Jul-09 07:25:05 :: created next repo
2026-Jul-09 07:25:15 :: duplicate provides check OK
	riscv64: NEW unmet dependencies detected:
 libgdal39#3.13.1-alt1:sisyphus_riscv64+129594.400.1.1 at 1781882739                libarrow.so.1200()(64bit) >= set:qikgJcItpMdPr7mXlUdgeJXYKN1xHAQNWlzq4DjVzIVUj4ymVCQA95KizlrcydoG0mPNVZ4Q0x8pgcrAhy65xGQsukxQIbj13AyYhc2CZE6cevDm3sZGejOb6MMfnk21xQZhyZqBJF9Bj60vQDg6L1GSIyCxNNLzOREUj5RU6NnOODhgBc4yhp11TXLyLY9OEIpVi1Ei3EJZzj5wWz5232ZiXLqjF230UogicbVKy5uyviEVD9LysB3ojjizZnvlOlnDSMbaBEIHMozZiSdNHY5doaVLQnZagbjbyg8NFRXNd5ElfZ0qPBLWvwLE5Zu9eMGTI6JWHipHFPWTTRTdDE1J08znfwF5J3cC4sZJq579f1uICFsFTMaOinEST9mmksmDISCPiLaielz3mrj9Kim3Ue
 libgdal39-debuginfo#3.13.1-alt1:sisyphus_riscv64+129594.400.1.1 at 1781882739      debug64(libarrow.so.1200)
 python3-module-pyarrow#23.0.1-alt1:sisyphus_riscv64+131953.1000.2.1 at 1783503416  python3(numba.cuda.cudadrv.devicearray) < 0
	ACLs of affected packages (2):
 arrow
 gdal
2026-Jul-09 07:25:40 :: unmets: riscv64 +3 -0 =3
2026-Jul-09 07:25:40 :: dependencies check FAILED
2026-Jul-09 07:25:40 :: task #131953 for sisyphus_riscv64 FAILED


More information about the Riscv-reports mailing list