[riscv-reports] [#131126] [test-only] sisyphus_riscv64 FAILED (try 6) llvm.git=22.1.8-alt0.port srpm=rust-1.96.0-alt1.src.rpm ...

Girar sisyphus_riscv64 awaiter iv noreply at basealt.ru
Wed Jul 8 20:31:25 MSK 2026


http://web.build.srt.basealt.ru/tasks/131126/logs/events.6.1.log

subtask  name     riscv64
   #700  firefox  3:31:48

2026-Jul-08 13:54:24 :: test-only task #131126 for sisyphus_riscv64 resumed by iv:
2026-Jul-08 13:54:24 :: message: sync
#100 build 22.1.8-alt0.port from /people/iv/packages/llvm.git fetched at 2026-Jul-01 11:48:02
#200 build rust-1.96.0-alt1.src.rpm from sisyphus_riscv64
#300 build fd-10.4.2-alt1.src.rpm from sisyphus_riscv64
#400 build librsvg-2.62.3-alt1.src.rpm from sisyphus_riscv64
#500 removed
#600 removed
#700 build 152.0.4-alt0.port from /gears/f/firefox.git fetched at 2026-Jul-08 13:53:42 from sisyphus_riscv64
2026-Jul-08 13:54:25 :: created build repo
2026-Jul-08 13:54:27 :: [riscv64] #100 llvm.git 22.1.8-alt0.port: build start
2026-Jul-08 13:55:03 :: [riscv64] #100 llvm.git 22.1.8-alt0.port: build swiftly SKIPPED
2026-Jul-08 13:55:03 :: [riscv64] #200 rust-1.96.0-alt1.src.rpm: build start
2026-Jul-08 13:55:15 :: [riscv64] #200 rust-1.96.0-alt1.src.rpm: build swiftly SKIPPED
2026-Jul-08 13:55:15 :: [riscv64] #300 fd-10.4.2-alt1.src.rpm: build start
2026-Jul-08 13:55:18 :: [riscv64] #300 fd-10.4.2-alt1.src.rpm: build swiftly SKIPPED
2026-Jul-08 13:55:18 :: [riscv64] #400 librsvg-2.62.3-alt1.src.rpm: build start
2026-Jul-08 13:55:22 :: [riscv64] #400 librsvg-2.62.3-alt1.src.rpm: build swiftly SKIPPED
2026-Jul-08 13:55:22 :: [riscv64] #700 firefox.git 152.0.4-alt0.port: build start
2026-Jul-08 17:27:10 :: [riscv64] #700 firefox.git 152.0.4-alt0.port: build OK
2026-Jul-08 17:27:10 :: 100: build check OK (cached)
riscv64/rpms/rust-cargo-1.96.0-alt1.riscv64.rpm: exception not found in '/usr/share/license-exception' directory: linking
riscv64/rpms/rust-cargo-1.96.0-alt1.riscv64.rpm: license not found in '/usr/share/license' directory: exception
2026-Jul-08 17:27:10 :: 200: build check OK (cached)
2026-Jul-08 17:27:10 :: 300: build check OK (cached)
2026-Jul-08 17:27:10 :: 400: build check OK (cached)
2026-Jul-08 17:27:14 :: 700: build check OK
2026-Jul-08 17:27:14 :: build check OK
2026-Jul-08 17:27:16 :: #100: llvm.git 22.1.8-alt0.port: version check OK
2026-Jul-08 17:27:17 :: #200: rust-1.96.0-alt1.src.rpm: version check OK
2026-Jul-08 17:27:17 :: #300: fd-10.4.2-alt1.src.rpm: version check OK
2026-Jul-08 17:27:17 :: #400: librsvg-2.62.3-alt1.src.rpm: version check OK
2026-Jul-08 17:27:17 :: #700: firefox.git 152.0.4-alt0.port: version check OK
2026-Jul-08 17:27:18 :: build version check OK
2026-Jul-08 17:27:18 :: noarch check OK
2026-Jul-08 17:27:19 :: plan: src +5 -5 =21244, noarch +10 -10 =22050, riscv64 +74 -74 =37562
#100 llvm22.1 22.1.5-alt0.port -> 22.1.8-alt0.port
 Wed Jul 01 2026 Ivan A. Melnikov <iv at altlinux.org> 22.1.8-alt0.port
 - Fix building w/o lldb.
 - Modernize loongarch64 and riscv64 build options:
   + enable lldb (at least it's buildable now)
   + build with clang
   + compress debuginfo to reduce the size of static libraries (fixes
     building on riscv64 by making devel subpackage fit into RPM's 4Gb
     payolad limit).
 Tue Jun 30 2026 L.A. Kostis <lakostis at altlinux.ru> 22.1.8-alt0.1
 - 22.1.8.
 [...]
2026-Jul-08 17:27:50 :: patched apt indices
2026-Jul-08 17:27:53 :: created next repo
2026-Jul-08 17:28:02 :: duplicate provides check OK
2026-Jul-08 17:28:27 :: dependencies check OK
2026-Jul-08 17:28:54 :: [riscv64] ELF symbols check OK
2026-Jul-08 17:29:15 :: [riscv64.0] #100 clang22.1: install check start
2026-Jul-08 17:29:15 :: [riscv64.0] #100 clang22.1: install check swiftly skipped
2026-Jul-08 17:29:15 :: [riscv64.0] #100 clang22.1-analyzer: install check start
2026-Jul-08 17:29:15 :: [riscv64.0] #100 clang22.1-analyzer: install check swiftly skipped
2026-Jul-08 17:29:15 :: [riscv64.0] #100 clang22.1-devel: install check start
2026-Jul-08 17:29:15 :: [riscv64.0] #100 clang22.1-devel: install check swiftly skipped
2026-Jul-08 17:29:15 :: [riscv64.0] #100 clang22.1-doc: install check start
2026-Jul-08 17:29:15 :: [riscv64.0] #100 clang22.1-doc: install check swiftly skipped
2026-Jul-08 17:29:15 :: [riscv64.0] #100 clang22.1-libs: install check start
2026-Jul-08 17:29:15 :: [riscv64.0] #100 clang22.1-libs: install check swiftly skipped
2026-Jul-08 17:29:15 :: [riscv64.0] #100 clang22.1-support: install check start
2026-Jul-08 17:29:15 :: [riscv64.0] #100 clang22.1-support: install check swiftly skipped
2026-Jul-08 17:29:15 :: [riscv64.0] #100 clang22.1-support-shared-runtimes: install check start
2026-Jul-08 17:29:15 :: [riscv64.0] #100 clang22.1-support-shared-runtimes: install check swiftly skipped
2026-Jul-08 17:29:15 :: [riscv64.0] #100 clang22.1-tools: install check start
2026-Jul-08 17:29:15 :: [riscv64.0] #100 clang22.1-tools: install check swiftly skipped
2026-Jul-08 17:29:15 :: [riscv64.1] #100 clangd22.1: install check start
2026-Jul-08 17:29:15 :: [riscv64.1] #100 clangd22.1: install check swiftly skipped
2026-Jul-08 17:29:15 :: [riscv64.0] #200 clippy: install check start
2026-Jul-08 17:29:15 :: [riscv64.0] #200 clippy: install check swiftly skipped
2026-Jul-08 17:29:15 :: [riscv64.1] #300 fd: install check start
2026-Jul-08 17:29:15 :: [riscv64.1] #300 fd: install check swiftly skipped
2026-Jul-08 17:29:15 :: [riscv64.0] #700 firefox: install check start
2026-Jul-08 17:29:15 :: [riscv64.1] #700 firefox-config-privacy: install check start
2026-Jul-08 17:29:15 :: [riscv64.2] #100 libclang-cpp22: install check start
2026-Jul-08 17:29:15 :: [riscv64.2] #100 libclang-cpp22: install check swiftly skipped
2026-Jul-08 17:29:15 :: [riscv64.2] #100 libclang22: install check start
2026-Jul-08 17:29:15 :: [riscv64.2] #100 libclang22: install check swiftly skipped
2026-Jul-08 17:29:15 :: [riscv64.2] #100 liblldb22.1: install check start
2026-Jul-08 17:29:15 :: [riscv64.2] #100 liblldb22.1: install check swiftly skipped
2026-Jul-08 17:29:15 :: [riscv64.2] #100 liblldb22.1-devel: install check start
2026-Jul-08 17:29:15 :: [riscv64.2] #100 liblldb22.1-devel: install check swiftly skipped
2026-Jul-08 17:29:15 :: [riscv64.2] #100 libmlir22.1: install check start
2026-Jul-08 17:29:15 :: [riscv64.2] #100 libmlir22.1: install check swiftly skipped
2026-Jul-08 17:29:15 :: [riscv64.2] #100 libmlir22.1-devel: install check start
2026-Jul-08 17:29:15 :: [riscv64.2] #100 libmlir22.1-devel: install check swiftly skipped
2026-Jul-08 17:29:15 :: [riscv64.2] #100 libomp22.1-devel: install check start
2026-Jul-08 17:29:15 :: [riscv64.2] #100 libomp22.1-devel: install check swiftly skipped
2026-Jul-08 17:29:15 :: [riscv64.3] #100 libomp5: install check start
2026-Jul-08 17:29:15 :: [riscv64.3] #100 libomp5: install check swiftly skipped
2026-Jul-08 17:29:15 :: [riscv64.2] #100 libomptarget22.1: install check start
2026-Jul-08 17:29:15 :: [riscv64.2] #100 libomptarget22.1: install check swiftly skipped
2026-Jul-08 17:29:15 :: [riscv64.3] #100 libpolly22.1-devel: install check start
2026-Jul-08 17:29:15 :: [riscv64.2] #100 libpolly22.1-doc: install check start
2026-Jul-08 17:29:15 :: [riscv64.3] #100 libpolly22.1-devel: install check swiftly skipped
2026-Jul-08 17:29:15 :: [riscv64.2] #100 libpolly22.1-doc: install check swiftly skipped
2026-Jul-08 17:29:15 :: [riscv64.3] #400 librsvg: install check start
2026-Jul-08 17:29:15 :: [riscv64.2] #400 librsvg-devel: install check start
2026-Jul-08 17:29:15 :: [riscv64.3] #400 librsvg: install check swiftly skipped
2026-Jul-08 17:29:15 :: [riscv64.2] #400 librsvg-devel: install check swiftly skipped
2026-Jul-08 17:29:15 :: [riscv64.3] #400 librsvg-devel-doc: install check start
2026-Jul-08 17:29:15 :: [riscv64.2] #400 librsvg-gir: install check start
2026-Jul-08 17:29:15 :: [riscv64.3] #400 librsvg-devel-doc: install check swiftly skipped
2026-Jul-08 17:29:15 :: [riscv64.2] #400 librsvg-gir: install check swiftly skipped
2026-Jul-08 17:29:15 :: [riscv64.2] #400 librsvg-gir-devel: install check start
2026-Jul-08 17:29:15 :: [riscv64.3] #400 librsvg-utils: install check start
2026-Jul-08 17:29:15 :: [riscv64.2] #400 librsvg-gir-devel: install check swiftly skipped
2026-Jul-08 17:29:15 :: [riscv64.3] #400 librsvg-utils: install check swiftly skipped
2026-Jul-08 17:29:15 :: [riscv64.2] #100 lld22.1: install check start
2026-Jul-08 17:29:15 :: [riscv64.2] #100 lld22.1: install check swiftly skipped
2026-Jul-08 17:29:15 :: [riscv64.3] #100 lld22.1-devel: install check start
2026-Jul-08 17:29:15 :: [riscv64.3] #100 lld22.1-devel: install check swiftly skipped
2026-Jul-08 17:29:15 :: [riscv64.2] #100 lld22.1-doc: install check start
2026-Jul-08 17:29:15 :: [riscv64.2] #100 lld22.1-doc: install check swiftly skipped
2026-Jul-08 17:29:15 :: [riscv64.3] #100 lldb22.1: install check start
2026-Jul-08 17:29:15 :: [riscv64.3] #100 lldb22.1: install check swiftly skipped
2026-Jul-08 17:29:15 :: [riscv64.2] #100 lldb22.1-doc: install check start
2026-Jul-08 17:29:15 :: [riscv64.3] #100 llvm22.1: install check start
2026-Jul-08 17:29:15 :: [riscv64.2] #100 lldb22.1-doc: install check swiftly skipped
2026-Jul-08 17:29:15 :: [riscv64.3] #100 llvm22.1: install check swiftly skipped
2026-Jul-08 17:29:15 :: [riscv64.4] #100 llvm22.1-bolt: install check start
2026-Jul-08 17:29:15 :: [riscv64.2] #100 llvm22.1-bolt-doc: install check start
2026-Jul-08 17:29:15 :: [riscv64.4] #100 llvm22.1-bolt: install check swiftly skipped
2026-Jul-08 17:29:15 :: [riscv64.2] #100 llvm22.1-bolt-doc: install check swiftly skipped
2026-Jul-08 17:29:15 :: [riscv64.3] #100 llvm22.1-cmake-common-modules: install check start
2026-Jul-08 17:29:15 :: [riscv64.3] #100 llvm22.1-cmake-common-modules: install check swiftly skipped
2026-Jul-08 17:29:15 :: [riscv64.2] #100 llvm22.1-devel: install check start
2026-Jul-08 17:29:15 :: [riscv64.4] #100 llvm22.1-doc: install check start
2026-Jul-08 17:29:15 :: [riscv64.2] #100 llvm22.1-devel: install check swiftly skipped
2026-Jul-08 17:29:15 :: [riscv64.4] #100 llvm22.1-doc: install check swiftly skipped
2026-Jul-08 17:29:15 :: [riscv64.3] #100 llvm22.1-filesystem: install check start
2026-Jul-08 17:29:15 :: [riscv64.3] #100 llvm22.1-filesystem: install check swiftly skipped
2026-Jul-08 17:29:15 :: [riscv64.4] #100 llvm22.1-gold: install check start
2026-Jul-08 17:29:15 :: [riscv64.2] #100 llvm22.1-libs: install check start
2026-Jul-08 17:29:15 :: [riscv64.4] #100 llvm22.1-gold: install check swiftly skipped
2026-Jul-08 17:29:15 :: [riscv64.2] #100 llvm22.1-libs: install check swiftly skipped
2026-Jul-08 17:29:15 :: [riscv64.3] #100 llvm22.1-polly: install check start
2026-Jul-08 17:29:15 :: [riscv64.3] #100 llvm22.1-polly: install check swiftly skipped
2026-Jul-08 17:29:15 :: [riscv64.4] #100 llvm22.1-tools: install check start
2026-Jul-08 17:29:15 :: [riscv64.4] #100 llvm22.1-tools: install check swiftly skipped
2026-Jul-08 17:29:15 :: [riscv64.2] #100 mlir22.1-tools: install check start
2026-Jul-08 17:29:15 :: [riscv64.3] #100 python3-module-lldb22.1: install check start
2026-Jul-08 17:29:15 :: [riscv64.2] #100 mlir22.1-tools: install check swiftly skipped
2026-Jul-08 17:29:15 :: [riscv64.3] #100 python3-module-lldb22.1: install check swiftly skipped
2026-Jul-08 17:29:15 :: [riscv64.4] #200 rust: install check start
2026-Jul-08 17:29:15 :: [riscv64.4] #200 rust: install check swiftly skipped
2026-Jul-08 17:29:15 :: [riscv64.2] #200 rust-analyzer: install check start
2026-Jul-08 17:29:15 :: [riscv64.3] #200 rust-cargo: install check start
2026-Jul-08 17:29:15 :: [riscv64.2] #200 rust-analyzer: install check swiftly skipped
2026-Jul-08 17:29:15 :: [riscv64.3] #200 rust-cargo: install check swiftly skipped
2026-Jul-08 17:29:15 :: [riscv64.4] #200 rust-doc: install check start
2026-Jul-08 17:29:15 :: [riscv64.3] #200 rust-full: install check start
2026-Jul-08 17:29:15 :: [riscv64.2] #200 rust-gdb: install check start
2026-Jul-08 17:29:16 :: [riscv64.3] #200 rust-full: install check swiftly skipped
2026-Jul-08 17:29:16 :: [riscv64.4] #200 rust-doc: install check swiftly skipped
2026-Jul-08 17:29:16 :: [riscv64.2] #200 rust-gdb: install check swiftly skipped
2026-Jul-08 17:29:16 :: [riscv64.5] #200 rust-riscv64gc-unknown-linux-gnu-target: install check start
2026-Jul-08 17:29:16 :: [riscv64.5] #200 rust-riscv64gc-unknown-linux-gnu-target: install check swiftly skipped
2026-Jul-08 17:29:16 :: [riscv64.3] #200 rust-src: install check start
2026-Jul-08 17:29:16 :: [riscv64.2] #200 rust-toolchain: install check start
2026-Jul-08 17:29:16 :: [riscv64.3] #200 rust-src: install check swiftly skipped
2026-Jul-08 17:29:16 :: [riscv64.5] #200 rust-wasm32-unknown-unknown-target: install check start
2026-Jul-08 17:29:16 :: [riscv64.2] #200 rust-toolchain: install check swiftly skipped
2026-Jul-08 17:29:16 :: [riscv64.5] #200 rust-wasm32-unknown-unknown-target: install check swiftly skipped
2026-Jul-08 17:29:16 :: [riscv64.4] #200 rustc: install check start
2026-Jul-08 17:29:16 :: [riscv64.4] #200 rustc: install check swiftly skipped
2026-Jul-08 17:29:16 :: [riscv64.3] #200 rustfmt: install check start
2026-Jul-08 17:29:16 :: [riscv64.3] #200 rustfmt: install check swiftly skipped
	riscv64: firefox=152.0.4-alt0.port post-install unowned files:
 /usr/share/gnome-shell
 /usr/share/gnome-shell/search-providers
 /usr/share/icons/hicolor/22x22
 /usr/share/icons/hicolor/22x22/apps
 /usr/share/icons/hicolor/24x24
 /usr/share/icons/hicolor/24x24/apps
 /usr/share/icons/hicolor/256x256
 /usr/share/icons/hicolor/256x256/apps
2026-Jul-08 17:31:20 :: [riscv64.0] #700 firefox: install check OK
2026-Jul-08 17:31:21 :: [riscv64.1] #700 firefox-config-privacy: install check OK
error: #100: llvm.git tag `22.1.8-alt0.port' is not inherited from /gears/l/llvm22.1.git branch `sisyphus_riscv64'
2026-Jul-08 17:31:25 :: gears inheritance check FAILED for: #100 
2026-Jul-08 17:31:25 :: task #131126 for sisyphus_riscv64 FAILED


More information about the Riscv-reports mailing list