[riscv-reports] [#131987] sisyphus_riscv64 FAILED srpm=eclipse-swt-4.38-alt2.src.rpm

Girar sisyphus_riscv64 awaiter recycler noreply at basealt.ru
Wed Jul 8 15:22:21 MSK 2026


http://web.build.srt.basealt.ru/tasks/131987/logs/events.1.1.log

2026-Jul-08 12:20:42 :: shared task #131987 for sisyphus_riscv64 started by recycler:
2026-Jul-08 12:20:42 :: message: sync
#100 build eclipse-swt-4.38-alt2.src.rpm
2026-Jul-08 12:20:48 :: [riscv64] #100 eclipse-swt-4.38-alt2.src.rpm: build start
2026-Jul-08 12:22:20 :: [riscv64] #100 eclipse-swt-4.38-alt2.src.rpm: build SKIPPED
2026-Jul-08 12:22:21 :: #100: eclipse-swt-4.38-alt2.src.rpm: no source package
2026-Jul-08 12:22:21 :: build check FAILED for: #100 
2026-Jul-08 12:22:21 :: task #131987 for sisyphus_riscv64 FAILED


More information about the Riscv-reports mailing list