[riscv-reports] [#131770] sisyphus_riscv64 FAILED (try 3) srpm=onnx-1.22.0-alt1.src.rpm
Girar sisyphus_riscv64 awaiter recycler
noreply at basealt.ru
Tue Jul 7 12:13:55 MSK 2026
http://web.build.srt.basealt.ru/tasks/131770/logs/events.3.1.log
subtask name riscv64
#100 onnx failed
2026-Jul-07 08:38:54 :: shared task #131770 for sisyphus_riscv64 resumed by recycler:
2026-Jul-07 08:38:54 :: message: sync
#100 build onnx-1.22.0-alt1.src.rpm
2026-Jul-07 08:39:01 :: [riscv64] #100 onnx-1.22.0-alt1.src.rpm: build start
[riscv64] outputs[i], ref_outputs[i], rtol=rtol, atol=atol
[riscv64] E AssertionError:
[riscv64] E Not equal to tolerance rtol=0.001, atol=1e-07
[riscv64] --
[riscv64] SKIPPED [1] onnx/test/test_external_data.py:787: Skip Windows test
[riscv64] FAILED onnx/test/test_backend_reference.py::OnnxBackendNodeModelTest::test_maxpool_2d_uint8_cpu
[riscv64] = 1 failed, 6033 passed, 3990 skipped, 52 subtests passed in 155.96s (0:02:35) =
2026-Jul-07 09:13:54 :: [riscv64] onnx-1.22.0-alt1.src.rpm: remote: build failed
2026-Jul-07 09:13:54 :: [riscv64] #100 onnx-1.22.0-alt1.src.rpm: build FAILED
2026-Jul-07 09:13:54 :: [riscv64] requesting cancellation of task processing
2026-Jul-07 09:13:54 :: [riscv64] build FAILED
2026-Jul-07 09:13:55 :: task #131770 for sisyphus_riscv64 FAILED
More information about the Riscv-reports
mailing list