[riscv-reports] [#131727] sisyphus_riscv64 FAILED srpm=alt-releases-matrix-0.2.9-alt1.src.rpm ...
Girar sisyphus_riscv64 awaiter recycler
noreply at basealt.ru
Tue Jul 7 04:52:49 MSK 2026
http://web.build.srt.basealt.ru/tasks/131727/logs/events.1.1.log
subtask name riscv64
#100 alt-releases-matrix 6:57
#200 zoryn failed
2026-Jul-07 01:27:13 :: shared task #131727 for sisyphus_riscv64 started by recycler:
2026-Jul-07 01:27:13 :: message: sync
#100 build alt-releases-matrix-0.2.9-alt1.src.rpm
#200 build zoryn-0.44.0-alt1.src.rpm
2026-Jul-07 01:27:13 :: created build repo
2026-Jul-07 01:27:22 :: [riscv64] #100 alt-releases-matrix-0.2.9-alt1.src.rpm: build start
2026-Jul-07 01:34:19 :: [riscv64] #100 alt-releases-matrix-0.2.9-alt1.src.rpm: build OK
2026-Jul-07 01:34:19 :: [riscv64] #200 zoryn-0.44.0-alt1.src.rpm: build start
ssh: client_loop: send disconnect: Broken pipe
bash: line 1: ./gb-remote-build: No such file or directory
2026-Jul-07 01:44:48 :: [riscv64] #200 zoryn-0.44.0-alt1.src.rpm: build FAILED
2026-Jul-07 01:44:48 :: [riscv64] requesting cancellation of task processing
rsync: [sender] change_dir "/tmp/homes/builder0/build" failed: No such file or directory (2)
rsync error: some files/attrs were not transferred (see previous errors) (code 23) at main.c(1863) [Receiver=3.2.7]
rsync: [Receiver] write error: Broken pipe (32)
rsync: [sender] change_dir "/tmp/homes/builder0/build" failed: No such file or directory (2)
rsync error: some files/attrs were not transferred (see previous errors) (code 23) at main.c(1863) [Receiver=3.2.7]
rsync: [Receiver] write error: Broken pipe (32)
rsync: [sender] change_dir "/tmp/homes/builder0/build" failed: No such file or directory (2)
rsync error: some files/attrs were not transferred (see previous errors) (code 23) at main.c(1863) [Receiver=3.2.7]
rsync: [Receiver] write error: Broken pipe (32)
rsync: [sender] change_dir "/tmp/homes/builder0/build" failed: No such file or directory (2)
rsync error: some files/attrs were not transferred (see previous errors) (code 23) at main.c(1863) [Receiver=3.2.7]
rsync: [Receiver] write error: Broken pipe (32)
rsync: [sender] change_dir "/tmp/homes/builder0/build" failed: No such file or directory (2)
rsync error: some files/attrs were not transferred (see previous errors) (code 23) at main.c(1863) [Receiver=3.2.7]
rsync: [Receiver] write error: Broken pipe (32)
rsync: [sender] change_dir "/tmp/homes/builder0/build" failed: No such file or directory (2)
rsync error: some files/attrs were not transferred (see previous errors) (code 23) at main.c(1863) [Receiver=3.2.7]
rsync: [Receiver] write error: Broken pipe (32)
rsync: [sender] change_dir "/tmp/homes/builder0/build" failed: No such file or directory (2)
rsync error: some files/attrs were not transferred (see previous errors) (code 23) at main.c(1863) [Receiver=3.2.7]
rsync: [Receiver] write error: Broken pipe (32)
rsync: [sender] change_dir "/tmp/homes/builder0/build" failed: No such file or directory (2)
rsync error: some files/attrs were not transferred (see previous errors) (code 23) at main.c(1863) [Receiver=3.2.7]
rsync: [Receiver] write error: Broken pipe (32)
rsync: [sender] change_dir "/tmp/homes/builder0/build" failed: No such file or directory (2)
rsync error: some files/attrs were not transferred (see previous errors) (code 23) at main.c(1863) [Receiver=3.2.7]
rsync: [Receiver] write error: Broken pipe (32)
rsync: [sender] change_dir "/tmp/homes/builder0/build" failed: No such file or directory (2)
rsync error: some files/attrs were not transferred (see previous errors) (code 23) at main.c(1863) [Receiver=3.2.7]
rsync: [Receiver] write error: Broken pipe (32)
rsync: [sender] change_dir "/tmp/homes/builder0/build" failed: No such file or directory (2)
rsync error: some files/attrs were not transferred (see previous errors) (code 23) at main.c(1863) [Receiver=3.2.7]
rsync: [Receiver] write error: Broken pipe (32)
rsync: [sender] change_dir "/tmp/homes/builder0/build" failed: No such file or directory (2)
rsync error: some files/attrs were not transferred (see previous errors) (code 23) at main.c(1863) [Receiver=3.2.7]
rsync: [Receiver] write error: Broken pipe (32)
rsync: [sender] change_dir "/tmp/homes/builder0/build" failed: No such file or directory (2)
rsync error: some files/attrs were not transferred (see previous errors) (code 23) at main.c(1863) [Receiver=3.2.7]
rsync: [Receiver] write error: Broken pipe (32)
rsync: [sender] change_dir "/tmp/homes/builder0/build" failed: No such file or directory (2)
rsync error: some files/attrs were not transferred (see previous errors) (code 23) at main.c(1863) [Receiver=3.2.7]
rsync: [Receiver] write error: Broken pipe (32)
rsync: [sender] change_dir "/tmp/homes/builder0/build" failed: No such file or directory (2)
rsync error: some files/attrs were not transferred (see previous errors) (code 23) at main.c(1863) [Receiver=3.2.7]
rsync: [Receiver] write error: Broken pipe (32)
rsync: [sender] change_dir "/tmp/homes/builder0/build" failed: No such file or directory (2)
rsync error: some files/attrs were not transferred (see previous errors) (code 23) at main.c(1863) [Receiver=3.2.7]
rsync: [Receiver] write error: Broken pipe (32)
rsync: [sender] change_dir "/tmp/homes/builder0/build" failed: No such file or directory (2)
rsync error: some files/attrs were not transferred (see previous errors) (code 23) at main.c(1863) [Receiver=3.2.7]
rsync: [Receiver] write error: Broken pipe (32)
rsync: [sender] change_dir "/tmp/homes/builder0/build" failed: No such file or directory (2)
rsync error: some files/attrs were not transferred (see previous errors) (code 23) at main.c(1863) [Receiver=3.2.7]
rsync: [Receiver] write error: Broken pipe (32)
rsync: [sender] change_dir "/tmp/homes/builder0/build" failed: No such file or directory (2)
rsync error: some files/attrs were not transferred (see previous errors) (code 23) at main.c(1863) [Receiver=3.2.7]
rsync: [Receiver] write error: Broken pipe (32)
rsync: [sender] change_dir "/tmp/homes/builder0/build" failed: No such file or directory (2)
rsync error: some files/attrs were not transferred (see previous errors) (code 23) at main.c(1863) [Receiver=3.2.7]
rsync: [Receiver] write error: Broken pipe (32)
rsync: [sender] change_dir "/tmp/homes/builder0/build" failed: No such file or directory (2)
rsync error: some files/attrs were not transferred (see previous errors) (code 23) at main.c(1863) [Receiver=3.2.7]
rsync: [Receiver] write error: Broken pipe (32)
rsync: [sender] change_dir "/tmp/homes/builder0/build" failed: No such file or directory (2)
rsync error: some files/attrs were not transferred (see previous errors) (code 23) at main.c(1863) [Receiver=3.2.7]
rsync: [Receiver] write error: Broken pipe (32)
rsync: [sender] change_dir "/tmp/homes/builder0/build" failed: No such file or directory (2)
rsync error: some files/attrs were not transferred (see previous errors) (code 23) at main.c(1863) [Receiver=3.2.7]
rsync: [Receiver] write error: Broken pipe (32)
rsync: [sender] change_dir "/tmp/homes/builder0/build" failed: No such file or directory (2)
rsync error: some files/attrs were not transferred (see previous errors) (code 23) at main.c(1863) [Receiver=3.2.7]
rsync: [Receiver] write error: Broken pipe (32)
rsync: [sender] change_dir "/tmp/homes/builder0/build" failed: No such file or directory (2)
rsync error: some files/attrs were not transferred (see previous errors) (code 23) at main.c(1863) [Receiver=3.2.7]
rsync: [Receiver] write error: Broken pipe (32)
rsync: [sender] change_dir "/tmp/homes/builder0/build" failed: No such file or directory (2)
rsync error: some files/attrs were not transferred (see previous errors) (code 23) at main.c(1863) [Receiver=3.2.7]
rsync: [Receiver] write error: Broken pipe (32)
rsync: [sender] change_dir "/tmp/homes/builder0/build" failed: No such file or directory (2)
rsync error: some files/attrs were not transferred (see previous errors) (code 23) at main.c(1863) [Receiver=3.2.7]
rsync: [Receiver] write error: Broken pipe (32)
rsync: [sender] change_dir "/tmp/homes/builder0/build" failed: No such file or directory (2)
rsync error: some files/attrs were not transferred (see previous errors) (code 23) at main.c(1863) [Receiver=3.2.7]
rsync: [Receiver] write error: Broken pipe (32)
rsync: [sender] change_dir "/tmp/homes/builder0/build" failed: No such file or directory (2)
rsync error: some files/attrs were not transferred (see previous errors) (code 23) at main.c(1863) [Receiver=3.2.7]
rsync: [Receiver] write error: Broken pipe (32)
rsync: [sender] change_dir "/tmp/homes/builder0/build" failed: No such file or directory (2)
rsync error: some files/attrs were not transferred (see previous errors) (code 23) at main.c(1863) [Receiver=3.2.7]
rsync: [Receiver] write error: Broken pipe (32)
rsync: [sender] change_dir "/tmp/homes/builder0/build" failed: No such file or directory (2)
rsync error: some files/attrs were not transferred (see previous errors) (code 23) at main.c(1863) [Receiver=3.2.7]
rsync: [Receiver] write error: Broken pipe (32)
rsync: [sender] change_dir "/tmp/homes/builder0/build" failed: No such file or directory (2)
rsync error: some files/attrs were not transferred (see previous errors) (code 23) at main.c(1863) [Receiver=3.2.7]
rsync: [Receiver] write error: Broken pipe (32)
rsync: [sender] change_dir "/tmp/homes/builder0/build" failed: No such file or directory (2)
rsync error: some files/attrs were not transferred (see previous errors) (code 23) at main.c(1863) [Receiver=3.2.7]
rsync: [Receiver] write error: Broken pipe (32)
rsync: [sender] change_dir "/tmp/homes/builder0/build" failed: No such file or directory (2)
rsync error: some files/attrs were not transferred (see previous errors) (code 23) at main.c(1863) [Receiver=3.2.7]
rsync: [Receiver] write error: Broken pipe (32)
rsync: [sender] change_dir "/tmp/homes/builder0/build" failed: No such file or directory (2)
rsync error: some files/attrs were not transferred (see previous errors) (code 23) at main.c(1863) [Receiver=3.2.7]
rsync: [Receiver] write error: Broken pipe (32)
rsync: [sender] change_dir "/tmp/homes/builder0/build" failed: No such file or directory (2)
rsync error: some files/attrs were not transferred (see previous errors) (code 23) at main.c(1863) [Receiver=3.2.7]
rsync: [Receiver] write error: Broken pipe (32)
rsync: [sender] change_dir "/tmp/homes/builder0/build" failed: No such file or directory (2)
rsync error: some files/attrs were not transferred (see previous errors) (code 23) at main.c(1863) [Receiver=3.2.7]
rsync: [Receiver] write error: Broken pipe (32)
rsync: [sender] change_dir "/tmp/homes/builder0/build" failed: No such file or directory (2)
rsync error: some files/attrs were not transferred (see previous errors) (code 23) at main.c(1863) [Receiver=3.2.7]
rsync: [Receiver] write error: Broken pipe (32)
rsync: [sender] change_dir "/tmp/homes/builder0/build" failed: No such file or directory (2)
rsync error: some files/attrs were not transferred (see previous errors) (code 23) at main.c(1863) [Receiver=3.2.7]
rsync: [Receiver] write error: Broken pipe (32)
rsync: [sender] change_dir "/tmp/homes/builder0/build" failed: No such file or directory (2)
rsync error: some files/attrs were not transferred (see previous errors) (code 23) at main.c(1863) [Receiver=3.2.7]
rsync: [Receiver] write error: Broken pipe (32)
rsync: [sender] change_dir "/tmp/homes/builder0/build" failed: No such file or directory (2)
rsync error: some files/attrs were not transferred (see previous errors) (code 23) at main.c(1863) [Receiver=3.2.7]
rsync: [Receiver] write error: Broken pipe (32)
rsync: [sender] change_dir "/tmp/homes/builder0/build" failed: No such file or directory (2)
rsync error: some files/attrs were not transferred (see previous errors) (code 23) at main.c(1863) [Receiver=3.2.7]
rsync: [Receiver] write error: Broken pipe (32)
rsync: [sender] change_dir "/tmp/homes/builder0/build" failed: No such file or directory (2)
rsync error: some files/attrs were not transferred (see previous errors) (code 23) at main.c(1863) [Receiver=3.2.7]
rsync: [Receiver] write error: Broken pipe (32)
rsync: [sender] change_dir "/tmp/homes/builder0/build" failed: No such file or directory (2)
rsync error: some files/attrs were not transferred (see previous errors) (code 23) at main.c(1863) [Receiver=3.2.7]
rsync: [Receiver] write error: Broken pipe (32)
rsync: [sender] change_dir "/tmp/homes/builder0/build" failed: No such file or directory (2)
rsync error: some files/attrs were not transferred (see previous errors) (code 23) at main.c(1863) [Receiver=3.2.7]
rsync: [Receiver] write error: Broken pipe (32)
rsync: [sender] change_dir "/tmp/homes/builder0/build" failed: No such file or directory (2)
rsync error: some files/attrs were not transferred (see previous errors) (code 23) at main.c(1863) [Receiver=3.2.7]
rsync: [Receiver] write error: Broken pipe (32)
rsync: [sender] change_dir "/tmp/homes/builder0/build" failed: No such file or directory (2)
rsync error: some files/attrs were not transferred (see previous errors) (code 23) at main.c(1863) [Receiver=3.2.7]
rsync: [Receiver] write error: Broken pipe (32)
rsync: [sender] change_dir "/tmp/homes/builder0/build" failed: No such file or directory (2)
rsync error: some files/attrs were not transferred (see previous errors) (code 23) at main.c(1863) [Receiver=3.2.7]
rsync: [Receiver] write error: Broken pipe (32)
rsync: [sender] change_dir "/tmp/homes/builder0/build" failed: No such file or directory (2)
rsync error: some files/attrs were not transferred (see previous errors) (code 23) at main.c(1863) [Receiver=3.2.7]
rsync: [Receiver] write error: Broken pipe (32)
rsync: [sender] change_dir "/tmp/homes/builder0/build" failed: No such file or directory (2)
rsync error: some files/attrs were not transferred (see previous errors) (code 23) at main.c(1863) [Receiver=3.2.7]
rsync: [Receiver] write error: Broken pipe (32)
rsync: [sender] change_dir "/tmp/homes/builder0/build" failed: No such file or directory (2)
rsync error: some files/attrs were not transferred (see previous errors) (code 23) at main.c(1863) [Receiver=3.2.7]
rsync: [Receiver] write error: Broken pipe (32)
rsync: [sender] change_dir "/tmp/homes/builder0/build" failed: No such file or directory (2)
rsync error: some files/attrs were not transferred (see previous errors) (code 23) at main.c(1863) [Receiver=3.2.7]
rsync: [Receiver] write error: Broken pipe (32)
rsync: [sender] change_dir "/tmp/homes/builder0/build" failed: No such file or directory (2)
rsync error: some files/attrs were not transferred (see previous errors) (code 23) at main.c(1863) [Receiver=3.2.7]
rsync: [Receiver] write error: Broken pipe (32)
rsync: [sender] change_dir "/tmp/homes/builder0/build" failed: No such file or directory (2)
rsync error: some files/attrs were not transferred (see previous errors) (code 23) at main.c(1863) [Receiver=3.2.7]
rsync: [Receiver] write error: Broken pipe (32)
rsync: [sender] change_dir "/tmp/homes/builder0/build" failed: No such file or directory (2)
rsync error: some files/attrs were not transferred (see previous errors) (code 23) at main.c(1863) [Receiver=3.2.7]
rsync: [Receiver] write error: Broken pipe (32)
rsync: [sender] change_dir "/tmp/homes/builder0/build" failed: No such file or directory (2)
rsync error: some files/attrs were not transferred (see previous errors) (code 23) at main.c(1863) [Receiver=3.2.7]
rsync: [Receiver] write error: Broken pipe (32)
rsync: [sender] change_dir "/tmp/homes/builder0/build" failed: No such file or directory (2)
rsync error: some files/attrs were not transferred (see previous errors) (code 23) at main.c(1863) [Receiver=3.2.7]
rsync: [Receiver] write error: Broken pipe (32)
rsync: [sender] change_dir "/tmp/homes/builder0/build" failed: No such file or directory (2)
rsync error: some files/attrs were not transferred (see previous errors) (code 23) at main.c(1863) [Receiver=3.2.7]
rsync: [Receiver] write error: Broken pipe (32)
rsync: [sender] change_dir "/tmp/homes/builder0/build" failed: No such file or directory (2)
rsync error: some files/attrs were not transferred (see previous errors) (code 23) at main.c(1863) [Receiver=3.2.7]
rsync: [Receiver] write error: Broken pipe (32)
rsync: [sender] change_dir "/tmp/homes/builder0/build" failed: No such file or directory (2)
rsync error: some files/attrs were not transferred (see previous errors) (code 23) at main.c(1863) [Receiver=3.2.7]
rsync: [Receiver] write error: Broken pipe (32)
rsync: [sender] change_dir "/tmp/homes/builder0/build" failed: No such file or directory (2)
rsync error: some files/attrs were not transferred (see previous errors) (code 23) at main.c(1863) [Receiver=3.2.7]
rsync: [Receiver] write error: Broken pipe (32)
rsync: [sender] change_dir "/tmp/homes/builder0/build" failed: No such file or directory (2)
rsync error: some files/attrs were not transferred (see previous errors) (code 23) at main.c(1863) [Receiver=3.2.7]
rsync: [Receiver] write error: Broken pipe (32)
rsync: [sender] change_dir "/tmp/homes/builder0/build" failed: No such file or directory (2)
rsync error: some files/attrs were not transferred (see previous errors) (code 23) at main.c(1863) [Receiver=3.2.7]
rsync: [Receiver] write error: Broken pipe (32)
rsync: [sender] change_dir "/tmp/homes/builder0/build" failed: No such file or directory (2)
rsync error: some files/attrs were not transferred (see previous errors) (code 23) at main.c(1863) [Receiver=3.2.7]
rsync: [Receiver] write error: Broken pipe (32)
rsync: [sender] change_dir "/tmp/homes/builder0/build" failed: No such file or directory (2)
rsync error: some files/attrs were not transferred (see previous errors) (code 23) at main.c(1863) [Receiver=3.2.7]
rsync: [Receiver] write error: Broken pipe (32)
rsync: [sender] change_dir "/tmp/homes/builder0/build" failed: No such file or directory (2)
rsync error: some files/attrs were not transferred (see previous errors) (code 23) at main.c(1863) [Receiver=3.2.7]
rsync: [Receiver] write error: Broken pipe (32)
rsync: [sender] change_dir "/tmp/homes/builder0/build" failed: No such file or directory (2)
rsync error: some files/attrs were not transferred (see previous errors) (code 23) at main.c(1863) [Receiver=3.2.7]
rsync: [Receiver] write error: Broken pipe (32)
rsync: [sender] change_dir "/tmp/homes/builder0/build" failed: No such file or directory (2)
rsync error: some files/attrs were not transferred (see previous errors) (code 23) at main.c(1863) [Receiver=3.2.7]
rsync: [Receiver] write error: Broken pipe (32)
rsync: [sender] change_dir "/tmp/homes/builder0/build" failed: No such file or directory (2)
rsync error: some files/attrs were not transferred (see previous errors) (code 23) at main.c(1863) [Receiver=3.2.7]
rsync: [Receiver] write error: Broken pipe (32)
rsync: [sender] change_dir "/tmp/homes/builder0/build" failed: No such file or directory (2)
rsync error: some files/attrs were not transferred (see previous errors) (code 23) at main.c(1863) [Receiver=3.2.7]
rsync: [Receiver] write error: Broken pipe (32)
rsync: [sender] change_dir "/tmp/homes/builder0/build" failed: No such file or directory (2)
rsync error: some files/attrs were not transferred (see previous errors) (code 23) at main.c(1863) [Receiver=3.2.7]
rsync: [Receiver] write error: Broken pipe (32)
rsync: [sender] change_dir "/tmp/homes/builder0/build" failed: No such file or directory (2)
rsync error: some files/attrs were not transferred (see previous errors) (code 23) at main.c(1863) [Receiver=3.2.7]
rsync: [Receiver] write error: Broken pipe (32)
rsync: [sender] change_dir "/tmp/homes/builder0/build" failed: No such file or directory (2)
rsync error: some files/attrs were not transferred (see previous errors) (code 23) at main.c(1863) [Receiver=3.2.7]
rsync: [Receiver] write error: Broken pipe (32)
rsync: [sender] change_dir "/tmp/homes/builder0/build" failed: No such file or directory (2)
rsync error: some files/attrs were not transferred (see previous errors) (code 23) at main.c(1863) [Receiver=3.2.7]
rsync: [Receiver] write error: Broken pipe (32)
rsync: [sender] change_dir "/tmp/homes/builder0/build" failed: No such file or directory (2)
rsync error: some files/attrs were not transferred (see previous errors) (code 23) at main.c(1863) [Receiver=3.2.7]
rsync: [Receiver] write error: Broken pipe (32)
rsync: [sender] change_dir "/tmp/homes/builder0/build" failed: No such file or directory (2)
rsync error: some files/attrs were not transferred (see previous errors) (code 23) at main.c(1863) [Receiver=3.2.7]
rsync: [Receiver] write error: Broken pipe (32)
rsync: [sender] change_dir "/tmp/homes/builder0/build" failed: No such file or directory (2)
rsync error: some files/attrs were not transferred (see previous errors) (code 23) at main.c(1863) [Receiver=3.2.7]
rsync: [Receiver] write error: Broken pipe (32)
rsync: [sender] change_dir "/tmp/homes/builder0/build" failed: No such file or directory (2)
rsync error: some files/attrs were not transferred (see previous errors) (code 23) at main.c(1863) [Receiver=3.2.7]
rsync: [Receiver] write error: Broken pipe (32)
rsync: [sender] change_dir "/tmp/homes/builder0/build" failed: No such file or directory (2)
rsync error: some files/attrs were not transferred (see previous errors) (code 23) at main.c(1863) [Receiver=3.2.7]
rsync: [Receiver] write error: Broken pipe (32)
rsync: [sender] change_dir "/tmp/homes/builder0/build" failed: No such file or directory (2)
rsync error: some files/attrs were not transferred (see previous errors) (code 23) at main.c(1863) [Receiver=3.2.7]
rsync: [Receiver] write error: Broken pipe (32)
rsync: [sender] change_dir "/tmp/homes/builder0/build" failed: No such file or directory (2)
rsync error: some files/attrs were not transferred (see previous errors) (code 23) at main.c(1863) [Receiver=3.2.7]
rsync: [Receiver] write error: Broken pipe (32)
rsync: [sender] change_dir "/tmp/homes/builder0/build" failed: No such file or directory (2)
rsync error: some files/attrs were not transferred (see previous errors) (code 23) at main.c(1863) [Receiver=3.2.7]
rsync: [Receiver] write error: Broken pipe (32)
rsync: [sender] change_dir "/tmp/homes/builder0/build" failed: No such file or directory (2)
rsync error: some files/attrs were not transferred (see previous errors) (code 23) at main.c(1863) [Receiver=3.2.7]
rsync: [Receiver] write error: Broken pipe (32)
rsync: [sender] change_dir "/tmp/homes/builder0/build" failed: No such file or directory (2)
rsync error: some files/attrs were not transferred (see previous errors) (code 23) at main.c(1863) [Receiver=3.2.7]
rsync: [Receiver] write error: Broken pipe (32)
rsync: [sender] change_dir "/tmp/homes/builder0/build" failed: No such file or directory (2)
rsync error: some files/attrs were not transferred (see previous errors) (code 23) at main.c(1863) [Receiver=3.2.7]
rsync: [Receiver] write error: Broken pipe (32)
rsync: [sender] change_dir "/tmp/homes/builder0/build" failed: No such file or directory (2)
rsync error: some files/attrs were not transferred (see previous errors) (code 23) at main.c(1863) [Receiver=3.2.7]
rsync: [Receiver] write error: Broken pipe (32)
rsync: [sender] change_dir "/tmp/homes/builder0/build" failed: No such file or directory (2)
rsync error: some files/attrs were not transferred (see previous errors) (code 23) at main.c(1863) [Receiver=3.2.7]
rsync: [Receiver] write error: Broken pipe (32)
rsync: [sender] change_dir "/tmp/homes/builder0/build" failed: No such file or directory (2)
rsync error: some files/attrs were not transferred (see previous errors) (code 23) at main.c(1863) [Receiver=3.2.7]
rsync: [Receiver] write error: Broken pipe (32)
rsync: [sender] change_dir "/tmp/homes/builder0/build" failed: No such file or directory (2)
rsync error: some files/attrs were not transferred (see previous errors) (code 23) at main.c(1863) [Receiver=3.2.7]
rsync: [Receiver] write error: Broken pipe (32)
rsync: [sender] change_dir "/tmp/homes/builder0/build" failed: No such file or directory (2)
rsync error: some files/attrs were not transferred (see previous errors) (code 23) at main.c(1863) [Receiver=3.2.7]
rsync: [Receiver] write error: Broken pipe (32)
rsync: [sender] change_dir "/tmp/homes/builder0/build" failed: No such file or directory (2)
rsync error: some files/attrs were not transferred (see previous errors) (code 23) at main.c(1863) [Receiver=3.2.7]
rsync: [Receiver] write error: Broken pipe (32)
rsync: [sender] change_dir "/tmp/homes/builder0/build" failed: No such file or directory (2)
rsync error: some files/attrs were not transferred (see previous errors) (code 23) at main.c(1863) [Receiver=3.2.7]
rsync: [Receiver] write error: Broken pipe (32)
rsync: [sender] change_dir "/tmp/homes/builder0/build" failed: No such file or directory (2)
rsync error: some files/attrs were not transferred (see previous errors) (code 23) at main.c(1863) [Receiver=3.2.7]
rsync: [Receiver] write error: Broken pipe (32)
rsync: [sender] change_dir "/tmp/homes/builder0/build" failed: No such file or directory (2)
rsync error: some files/attrs were not transferred (see previous errors) (code 23) at main.c(1863) [Receiver=3.2.7]
rsync: [Receiver] write error: Broken pipe (32)
rsync: [sender] change_dir "/tmp/homes/builder0/build" failed: No such file or directory (2)
rsync error: some files/attrs were not transferred (see previous errors) (code 23) at main.c(1863) [Receiver=3.2.7]
rsync: [Receiver] write error: Broken pipe (32)
rsync: [sender] change_dir "/tmp/homes/builder0/build" failed: No such file or directory (2)
rsync error: some files/attrs were not transferred (see previous errors) (code 23) at main.c(1863) [Receiver=3.2.7]
rsync: [Receiver] write error: Broken pipe (32)
rsync: [sender] change_dir "/tmp/homes/builder0/build" failed: No such file or directory (2)
rsync error: some files/attrs were not transferred (see previous errors) (code 23) at main.c(1863) [Receiver=3.2.7]
rsync: [Receiver] write error: Broken pipe (32)
rsync: [sender] change_dir "/tmp/homes/builder0/build" failed: No such file or directory (2)
rsync error: some files/attrs were not transferred (see previous errors) (code 23) at main.c(1863) [Receiver=3.2.7]
rsync: [Receiver] write error: Broken pipe (32)
rsync: [sender] change_dir "/tmp/homes/builder0/build" failed: No such file or directory (2)
rsync error: some files/attrs were not transferred (see previous errors) (code 23) at main.c(1863) [Receiver=3.2.7]
rsync: [Receiver] write error: Broken pipe (32)
rsync: [sender] change_dir "/tmp/homes/builder0/build" failed: No such file or directory (2)
rsync error: some files/attrs were not transferred (see previous errors) (code 23) at main.c(1863) [Receiver=3.2.7]
rsync: [Receiver] write error: Broken pipe (32)
rsync: [sender] change_dir "/tmp/homes/builder0/build" failed: No such file or directory (2)
rsync error: some files/attrs were not transferred (see previous errors) (code 23) at main.c(1863) [Receiver=3.2.7]
rsync: [Receiver] write error: Broken pipe (32)
rsync: [sender] change_dir "/tmp/homes/builder0/build" failed: No such file or directory (2)
rsync error: some files/attrs were not transferred (see previous errors) (code 23) at main.c(1863) [Receiver=3.2.7]
rsync: [Receiver] write error: Broken pipe (32)
rsync: [sender] change_dir "/tmp/homes/builder0/build" failed: No such file or directory (2)
rsync error: some files/attrs were not transferred (see previous errors) (code 23) at main.c(1863) [Receiver=3.2.7]
rsync: [Receiver] write error: Broken pipe (32)
rsync: [sender] change_dir "/tmp/homes/builder0/build" failed: No such file or directory (2)
rsync error: some files/attrs were not transferred (see previous errors) (code 23) at main.c(1863) [Receiver=3.2.7]
rsync: [Receiver] write error: Broken pipe (32)
rsync: [sender] change_dir "/tmp/homes/builder0/build" failed: No such file or directory (2)
rsync error: some files/attrs were not transferred (see previous errors) (code 23) at main.c(1863) [Receiver=3.2.7]
rsync: [Receiver] write error: Broken pipe (32)
rsync: [sender] change_dir "/tmp/homes/builder0/build" failed: No such file or directory (2)
rsync error: some files/attrs were not transferred (see previous errors) (code 23) at main.c(1863) [Receiver=3.2.7]
rsync: [Receiver] write error: Broken pipe (32)
rsync: [sender] change_dir "/tmp/homes/builder0/build" failed: No such file or directory (2)
rsync error: some files/attrs were not transferred (see previous errors) (code 23) at main.c(1863) [Receiver=3.2.7]
rsync: [Receiver] write error: Broken pipe (32)
rsync: [sender] change_dir "/tmp/homes/builder0/build" failed: No such file or directory (2)
rsync error: some files/attrs were not transferred (see previous errors) (code 23) at main.c(1863) [Receiver=3.2.7]
rsync: [Receiver] write error: Broken pipe (32)
rsync: [sender] change_dir "/tmp/homes/builder0/build" failed: No such file or directory (2)
rsync error: some files/attrs were not transferred (see previous errors) (code 23) at main.c(1863) [Receiver=3.2.7]
rsync: [Receiver] write error: Broken pipe (32)
rsync: [sender] change_dir "/tmp/homes/builder0/build" failed: No such file or directory (2)
rsync error: some files/attrs were not transferred (see previous errors) (code 23) at main.c(1863) [Receiver=3.2.7]
rsync: [Receiver] write error: Broken pipe (32)
rsync: [sender] change_dir "/tmp/homes/builder0/build" failed: No such file or directory (2)
rsync error: some files/attrs were not transferred (see previous errors) (code 23) at main.c(1863) [Receiver=3.2.7]
rsync: [Receiver] write error: Broken pipe (32)
rsync: [sender] change_dir "/tmp/homes/builder0/build" failed: No such file or directory (2)
rsync error: some files/attrs were not transferred (see previous errors) (code 23) at main.c(1863) [Receiver=3.2.7]
rsync: [Receiver] write error: Broken pipe (32)
rsync: [sender] change_dir "/tmp/homes/builder0/build" failed: No such file or directory (2)
rsync error: some files/attrs were not transferred (see previous errors) (code 23) at main.c(1863) [Receiver=3.2.7]
rsync: [Receiver] write error: Broken pipe (32)
rsync: [sender] change_dir "/tmp/homes/builder0/build" failed: No such file or directory (2)
rsync error: some files/attrs were not transferred (see previous errors) (code 23) at main.c(1863) [Receiver=3.2.7]
rsync: [Receiver] write error: Broken pipe (32)
rsync: [sender] change_dir "/tmp/homes/builder0/build" failed: No such file or directory (2)
rsync error: some files/attrs were not transferred (see previous errors) (code 23) at main.c(1863) [Receiver=3.2.7]
rsync: [Receiver] write error: Broken pipe (32)
rsync: [sender] change_dir "/tmp/homes/builder0/build" failed: No such file or directory (2)
rsync error: some files/attrs were not transferred (see previous errors) (code 23) at main.c(1863) [Receiver=3.2.7]
rsync: [Receiver] write error: Broken pipe (32)
rsync: [sender] change_dir "/tmp/homes/builder0/build" failed: No such file or directory (2)
rsync error: some files/attrs were not transferred (see previous errors) (code 23) at main.c(1863) [Receiver=3.2.7]
rsync: [Receiver] write error: Broken pipe (32)
rsync: [sender] change_dir "/tmp/homes/builder0/build" failed: No such file or directory (2)
rsync error: some files/attrs were not transferred (see previous errors) (code 23) at main.c(1863) [Receiver=3.2.7]
rsync: [Receiver] write error: Broken pipe (32)
rsync: [sender] change_dir "/tmp/homes/builder0/build" failed: No such file or directory (2)
rsync error: some files/attrs were not transferred (see previous errors) (code 23) at main.c(1863) [Receiver=3.2.7]
rsync: [Receiver] write error: Broken pipe (32)
rsync: [sender] change_dir "/tmp/homes/builder0/build" failed: No such file or directory (2)
rsync error: some files/attrs were not transferred (see previous errors) (code 23) at main.c(1863) [Receiver=3.2.7]
rsync: [Receiver] write error: Broken pipe (32)
rsync: [sender] change_dir "/tmp/homes/builder0/build" failed: No such file or directory (2)
rsync error: some files/attrs were not transferred (see previous errors) (code 23) at main.c(1863) [Receiver=3.2.7]
rsync: [Receiver] write error: Broken pipe (32)
rsync: [sender] change_dir "/tmp/homes/builder0/build" failed: No such file or directory (2)
rsync error: some files/attrs were not transferred (see previous errors) (code 23) at main.c(1863) [Receiver=3.2.7]
rsync: [Receiver] write error: Broken pipe (32)
rsync: [sender] change_dir "/tmp/homes/builder0/build" failed: No such file or directory (2)
rsync error: some files/attrs were not transferred (see previous errors) (code 23) at main.c(1863) [Receiver=3.2.7]
rsync: [Receiver] write error: Broken pipe (32)
rsync: [sender] change_dir "/tmp/homes/builder0/build" failed: No such file or directory (2)
rsync error: some files/attrs were not transferred (see previous errors) (code 23) at main.c(1863) [Receiver=3.2.7]
rsync: [Receiver] write error: Broken pipe (32)
rsync: [sender] change_dir "/tmp/homes/builder0/build" failed: No such file or directory (2)
rsync error: some files/attrs were not transferred (see previous errors) (code 23) at main.c(1863) [Receiver=3.2.7]
rsync: [Receiver] write error: Broken pipe (32)
rsync: [sender] change_dir "/tmp/homes/builder0/build" failed: No such file or directory (2)
rsync error: some files/attrs were not transferred (see previous errors) (code 23) at main.c(1863) [Receiver=3.2.7]
rsync: [Receiver] write error: Broken pipe (32)
rsync: [sender] change_dir "/tmp/homes/builder0/build" failed: No such file or directory (2)
rsync error: some files/attrs were not transferred (see previous errors) (code 23) at main.c(1863) [Receiver=3.2.7]
rsync: [Receiver] write error: Broken pipe (32)
rsync: [sender] change_dir "/tmp/homes/builder0/build" failed: No such file or directory (2)
rsync error: some files/attrs were not transferred (see previous errors) (code 23) at main.c(1863) [Receiver=3.2.7]
rsync: [Receiver] write error: Broken pipe (32)
rsync: [sender] change_dir "/tmp/homes/builder0/build" failed: No such file or directory (2)
rsync error: some files/attrs were not transferred (see previous errors) (code 23) at main.c(1863) [Receiver=3.2.7]
rsync: [Receiver] write error: Broken pipe (32)
rsync: [sender] change_dir "/tmp/homes/builder0/build" failed: No such file or directory (2)
rsync error: some files/attrs were not transferred (see previous errors) (code 23) at main.c(1863) [Receiver=3.2.7]
rsync: [Receiver] write error: Broken pipe (32)
rsync: [sender] change_dir "/tmp/homes/builder0/build" failed: No such file or directory (2)
rsync error: some files/attrs were not transferred (see previous errors) (code 23) at main.c(1863) [Receiver=3.2.7]
rsync: [Receiver] write error: Broken pipe (32)
rsync: [sender] change_dir "/tmp/homes/builder0/build" failed: No such file or directory (2)
rsync error: some files/attrs were not transferred (see previous errors) (code 23) at main.c(1863) [Receiver=3.2.7]
rsync: [Receiver] write error: Broken pipe (32)
rsync: [sender] change_dir "/tmp/homes/builder0/build" failed: No such file or directory (2)
rsync error: some files/attrs were not transferred (see previous errors) (code 23) at main.c(1863) [Receiver=3.2.7]
rsync: [Receiver] write error: Broken pipe (32)
rsync: [sender] change_dir "/tmp/homes/builder0/build" failed: No such file or directory (2)
rsync error: some files/attrs were not transferred (see previous errors) (code 23) at main.c(1863) [Receiver=3.2.7]
rsync: [Receiver] write error: Broken pipe (32)
rsync: [sender] change_dir "/tmp/homes/builder0/build" failed: No such file or directory (2)
rsync error: some files/attrs were not transferred (see previous errors) (code 23) at main.c(1863) [Receiver=3.2.7]
rsync: [Receiver] write error: Broken pipe (32)
rsync: [sender] change_dir "/tmp/homes/builder0/build" failed: No such file or directory (2)
rsync error: some files/attrs were not transferred (see previous errors) (code 23) at main.c(1863) [Receiver=3.2.7]
rsync: [Receiver] write error: Broken pipe (32)
rsync: [sender] change_dir "/tmp/homes/builder0/build" failed: No such file or directory (2)
rsync error: some files/attrs were not transferred (see previous errors) (code 23) at main.c(1863) [Receiver=3.2.7]
rsync: [Receiver] write error: Broken pipe (32)
rsync: [sender] change_dir "/tmp/homes/builder0/build" failed: No such file or directory (2)
rsync error: some files/attrs were not transferred (see previous errors) (code 23) at main.c(1863) [Receiver=3.2.7]
rsync: [Receiver] write error: Broken pipe (32)
rsync: [sender] change_dir "/tmp/homes/builder0/build" failed: No such file or directory (2)
rsync error: some files/attrs were not transferred (see previous errors) (code 23) at main.c(1863) [Receiver=3.2.7]
rsync: [Receiver] write error: Broken pipe (32)
rsync: [sender] change_dir "/tmp/homes/builder0/build" failed: No such file or directory (2)
rsync error: some files/attrs were not transferred (see previous errors) (code 23) at main.c(1863) [Receiver=3.2.7]
rsync: [Receiver] write error: Broken pipe (32)
rsync: [sender] change_dir "/tmp/homes/builder0/build" failed: No such file or directory (2)
rsync error: some files/attrs were not transferred (see previous errors) (code 23) at main.c(1863) [Receiver=3.2.7]
rsync: [Receiver] write error: Broken pipe (32)
rsync: [sender] change_dir "/tmp/homes/builder0/build" failed: No such file or directory (2)
rsync error: some files/attrs were not transferred (see previous errors) (code 23) at main.c(1863) [Receiver=3.2.7]
rsync: [Receiver] write error: Broken pipe (32)
rsync: [sender] change_dir "/tmp/homes/builder0/build" failed: No such file or directory (2)
rsync error: some files/attrs were not transferred (see previous errors) (code 23) at main.c(1863) [Receiver=3.2.7]
rsync: [Receiver] write error: Broken pipe (32)
rsync: [sender] change_dir "/tmp/homes/builder0/build" failed: No such file or directory (2)
rsync error: some files/attrs were not transferred (see previous errors) (code 23) at main.c(1863) [Receiver=3.2.7]
rsync: [Receiver] write error: Broken pipe (32)
rsync: [sender] change_dir "/tmp/homes/builder0/build" failed: No such file or directory (2)
rsync error: some files/attrs were not transferred (see previous errors) (code 23) at main.c(1863) [Receiver=3.2.7]
rsync: [Receiver] write error: Broken pipe (32)
rsync: [sender] change_dir "/tmp/homes/builder0/build" failed: No such file or directory (2)
rsync error: some files/attrs were not transferred (see previous errors) (code 23) at main.c(1863) [Receiver=3.2.7]
rsync: [Receiver] write error: Broken pipe (32)
rsync: [sender] change_dir "/tmp/homes/builder0/build" failed: No such file or directory (2)
rsync error: some files/attrs were not transferred (see previous errors) (code 23) at main.c(1863) [Receiver=3.2.7]
rsync: [Receiver] write error: Broken pipe (32)
rsync: [sender] change_dir "/tmp/homes/builder0/build" failed: No such file or directory (2)
rsync error: some files/attrs were not transferred (see previous errors) (code 23) at main.c(1863) [Receiver=3.2.7]
rsync: [Receiver] write error: Broken pipe (32)
rsync: [sender] change_dir "/tmp/homes/builder0/build" failed: No such file or directory (2)
rsync error: some files/attrs were not transferred (see previous errors) (code 23) at main.c(1863) [Receiver=3.2.7]
rsync: [Receiver] write error: Broken pipe (32)
rsync: [sender] change_dir "/tmp/homes/builder0/build" failed: No such file or directory (2)
rsync error: some files/attrs were not transferred (see previous errors) (code 23) at main.c(1863) [Receiver=3.2.7]
rsync: [Receiver] write error: Broken pipe (32)
rsync: [sender] change_dir "/tmp/homes/builder0/build" failed: No such file or directory (2)
rsync error: some files/attrs were not transferred (see previous errors) (code 23) at main.c(1863) [Receiver=3.2.7]
rsync: [Receiver] write error: Broken pipe (32)
rsync: [sender] change_dir "/tmp/homes/builder0/build" failed: No such file or directory (2)
rsync error: some files/attrs were not transferred (see previous errors) (code 23) at main.c(1863) [Receiver=3.2.7]
rsync: [Receiver] write error: Broken pipe (32)
rsync: [sender] change_dir "/tmp/homes/builder0/build" failed: No such file or directory (2)
rsync error: some files/attrs were not transferred (see previous errors) (code 23) at main.c(1863) [Receiver=3.2.7]
rsync: [Receiver] write error: Broken pipe (32)
rsync: [sender] change_dir "/tmp/homes/builder0/build" failed: No such file or directory (2)
rsync error: some files/attrs were not transferred (see previous errors) (code 23) at main.c(1863) [Receiver=3.2.7]
rsync: [Receiver] write error: Broken pipe (32)
rsync: [sender] change_dir "/tmp/homes/builder0/build" failed: No such file or directory (2)
rsync error: some files/attrs were not transferred (see previous errors) (code 23) at main.c(1863) [Receiver=3.2.7]
rsync: [Receiver] write error: Broken pipe (32)
rsync: [sender] change_dir "/tmp/homes/builder0/build" failed: No such file or directory (2)
rsync error: some files/attrs were not transferred (see previous errors) (code 23) at main.c(1863) [Receiver=3.2.7]
rsync: [Receiver] write error: Broken pipe (32)
rsync: [sender] change_dir "/tmp/homes/builder0/build" failed: No such file or directory (2)
rsync error: some files/attrs were not transferred (see previous errors) (code 23) at main.c(1863) [Receiver=3.2.7]
rsync: [Receiver] write error: Broken pipe (32)
rsync: [sender] change_dir "/tmp/homes/builder0/build" failed: No such file or directory (2)
rsync error: some files/attrs were not transferred (see previous errors) (code 23) at main.c(1863) [Receiver=3.2.7]
rsync: [Receiver] write error: Broken pipe (32)
rsync: [sender] change_dir "/tmp/homes/builder0/build" failed: No such file or directory (2)
rsync error: some files/attrs were not transferred (see previous errors) (code 23) at main.c(1863) [Receiver=3.2.7]
rsync: [Receiver] write error: Broken pipe (32)
rsync: [sender] change_dir "/tmp/homes/builder0/build" failed: No such file or directory (2)
rsync error: some files/attrs were not transferred (see previous errors) (code 23) at main.c(1863) [Receiver=3.2.7]
rsync: [Receiver] write error: Broken pipe (32)
rsync: [sender] change_dir "/tmp/homes/builder0/build" failed: No such file or directory (2)
rsync error: some files/attrs were not transferred (see previous errors) (code 23) at main.c(1863) [Receiver=3.2.7]
rsync: [Receiver] write error: Broken pipe (32)
rsync: [sender] change_dir "/tmp/homes/builder0/build" failed: No such file or directory (2)
rsync error: some files/attrs were not transferred (see previous errors) (code 23) at main.c(1863) [Receiver=3.2.7]
rsync: [Receiver] write error: Broken pipe (32)
rsync: [sender] change_dir "/tmp/homes/builder0/build" failed: No such file or directory (2)
rsync error: some files/attrs were not transferred (see previous errors) (code 23) at main.c(1863) [Receiver=3.2.7]
rsync: [Receiver] write error: Broken pipe (32)
rsync: [sender] change_dir "/tmp/homes/builder0/build" failed: No such file or directory (2)
rsync error: some files/attrs were not transferred (see previous errors) (code 23) at main.c(1863) [Receiver=3.2.7]
rsync: [Receiver] write error: Broken pipe (32)
rsync: [sender] change_dir "/tmp/homes/builder0/build" failed: No such file or directory (2)
rsync error: some files/attrs were not transferred (see previous errors) (code 23) at main.c(1863) [Receiver=3.2.7]
rsync: [Receiver] write error: Broken pipe (32)
rsync: [sender] change_dir "/tmp/homes/builder0/build" failed: No such file or directory (2)
rsync error: some files/attrs were not transferred (see previous errors) (code 23) at main.c(1863) [Receiver=3.2.7]
rsync: [Receiver] write error: Broken pipe (32)
rsync: [sender] change_dir "/tmp/homes/builder0/build" failed: No such file or directory (2)
rsync error: some files/attrs were not transferred (see previous errors) (code 23) at main.c(1863) [Receiver=3.2.7]
rsync: [Receiver] write error: Broken pipe (32)
rsync: [sender] change_dir "/tmp/homes/builder0/build" failed: No such file or directory (2)
rsync error: some files/attrs were not transferred (see previous errors) (code 23) at main.c(1863) [Receiver=3.2.7]
rsync: [Receiver] write error: Broken pipe (32)
rsync: [sender] change_dir "/tmp/homes/builder0/build" failed: No such file or directory (2)
rsync error: some files/attrs were not transferred (see previous errors) (code 23) at main.c(1863) [Receiver=3.2.7]
rsync: [Receiver] write error: Broken pipe (32)
rsync: [sender] change_dir "/tmp/homes/builder0/build" failed: No such file or directory (2)
rsync error: some files/attrs were not transferred (see previous errors) (code 23) at main.c(1863) [Receiver=3.2.7]
rsync: [Receiver] write error: Broken pipe (32)
rsync: [sender] change_dir "/tmp/homes/builder0/build" failed: No such file or directory (2)
rsync error: some files/attrs were not transferred (see previous errors) (code 23) at main.c(1863) [Receiver=3.2.7]
rsync: [Receiver] write error: Broken pipe (32)
rsync: [sender] change_dir "/tmp/homes/builder0/build" failed: No such file or directory (2)
rsync error: some files/attrs were not transferred (see previous errors) (code 23) at main.c(1863) [Receiver=3.2.7]
rsync: [Receiver] write error: Broken pipe (32)
rsync: [sender] change_dir "/tmp/homes/builder0/build" failed: No such file or directory (2)
rsync error: some files/attrs were not transferred (see previous errors) (code 23) at main.c(1863) [Receiver=3.2.7]
rsync: [Receiver] write error: Broken pipe (32)
rsync: [sender] change_dir "/tmp/homes/builder0/build" failed: No such file or directory (2)
rsync error: some files/attrs were not transferred (see previous errors) (code 23) at main.c(1863) [Receiver=3.2.7]
rsync: [Receiver] write error: Broken pipe (32)
rsync: [sender] change_dir "/tmp/homes/builder0/build" failed: No such file or directory (2)
rsync error: some files/attrs were not transferred (see previous errors) (code 23) at main.c(1863) [Receiver=3.2.7]
rsync: [Receiver] write error: Broken pipe (32)
rsync: [sender] change_dir "/tmp/homes/builder0/build" failed: No such file or directory (2)
rsync error: some files/attrs were not transferred (see previous errors) (code 23) at main.c(1863) [Receiver=3.2.7]
rsync: [Receiver] write error: Broken pipe (32)
rsync: [sender] change_dir "/tmp/homes/builder0/build" failed: No such file or directory (2)
rsync error: some files/attrs were not transferred (see previous errors) (code 23) at main.c(1863) [Receiver=3.2.7]
rsync: [Receiver] write error: Broken pipe (32)
rsync: [sender] change_dir "/tmp/homes/builder0/build" failed: No such file or directory (2)
rsync error: some files/attrs were not transferred (see previous errors) (code 23) at main.c(1863) [Receiver=3.2.7]
rsync: [Receiver] write error: Broken pipe (32)
rsync: [sender] change_dir "/tmp/homes/builder0/build" failed: No such file or directory (2)
rsync error: some files/attrs were not transferred (see previous errors) (code 23) at main.c(1863) [Receiver=3.2.7]
rsync: [Receiver] write error: Broken pipe (32)
rsync: [sender] change_dir "/tmp/homes/builder0/build" failed: No such file or directory (2)
rsync error: some files/attrs were not transferred (see previous errors) (code 23) at main.c(1863) [Receiver=3.2.7]
rsync: [Receiver] write error: Broken pipe (32)
rsync: [sender] change_dir "/tmp/homes/builder0/build" failed: No such file or directory (2)
rsync error: some files/attrs were not transferred (see previous errors) (code 23) at main.c(1863) [Receiver=3.2.7]
rsync: [Receiver] write error: Broken pipe (32)
rsync: [sender] change_dir "/tmp/homes/builder0/build" failed: No such file or directory (2)
rsync error: some files/attrs were not transferred (see previous errors) (code 23) at main.c(1863) [Receiver=3.2.7]
rsync: [Receiver] write error: Broken pipe (32)
rsync: [sender] change_dir "/tmp/homes/builder0/build" failed: No such file or directory (2)
rsync error: some files/attrs were not transferred (see previous errors) (code 23) at main.c(1863) [Receiver=3.2.7]
rsync: [Receiver] write error: Broken pipe (32)
rsync: [sender] change_dir "/tmp/homes/builder0/build" failed: No such file or directory (2)
rsync error: some files/attrs were not transferred (see previous errors) (code 23) at main.c(1863) [Receiver=3.2.7]
rsync: [Receiver] write error: Broken pipe (32)
rsync: [sender] change_dir "/tmp/homes/builder0/build" failed: No such file or directory (2)
rsync error: some files/attrs were not transferred (see previous errors) (code 23) at main.c(1863) [Receiver=3.2.7]
rsync: [Receiver] write error: Broken pipe (32)
rsync: [sender] change_dir "/tmp/homes/builder0/build" failed: No such file or directory (2)
rsync error: some files/attrs were not transferred (see previous errors) (code 23) at main.c(1863) [Receiver=3.2.7]
rsync: [Receiver] write error: Broken pipe (32)
rsync: [sender] change_dir "/tmp/homes/builder0/build" failed: No such file or directory (2)
rsync error: some files/attrs were not transferred (see previous errors) (code 23) at main.c(1863) [Receiver=3.2.7]
rsync: [Receiver] write error: Broken pipe (32)
rsync: [sender] change_dir "/tmp/homes/builder0/build" failed: No such file or directory (2)
rsync error: some files/attrs were not transferred (see previous errors) (code 23) at main.c(1863) [Receiver=3.2.7]
rsync: [Receiver] write error: Broken pipe (32)
rsync: [sender] change_dir "/tmp/homes/builder0/build" failed: No such file or directory (2)
rsync error: some files/attrs were not transferred (see previous errors) (code 23) at main.c(1863) [Receiver=3.2.7]
rsync: [Receiver] write error: Broken pipe (32)
rsync: [sender] change_dir "/tmp/homes/builder0/build" failed: No such file or directory (2)
rsync error: some files/attrs were not transferred (see previous errors) (code 23) at main.c(1863) [Receiver=3.2.7]
rsync: [Receiver] write error: Broken pipe (32)
rsync: [sender] change_dir "/tmp/homes/builder0/build" failed: No such file or directory (2)
rsync error: some files/attrs were not transferred (see previous errors) (code 23) at main.c(1863) [Receiver=3.2.7]
rsync: [Receiver] write error: Broken pipe (32)
rsync: [sender] change_dir "/tmp/homes/builder0/build" failed: No such file or directory (2)
rsync error: some files/attrs were not transferred (see previous errors) (code 23) at main.c(1863) [Receiver=3.2.7]
rsync: [Receiver] write error: Broken pipe (32)
rsync: [sender] change_dir "/tmp/homes/builder0/build" failed: No such file or directory (2)
rsync error: some files/attrs were not transferred (see previous errors) (code 23) at main.c(1863) [Receiver=3.2.7]
rsync: [Receiver] write error: Broken pipe (32)
rsync: [sender] change_dir "/tmp/homes/builder0/build" failed: No such file or directory (2)
rsync error: some files/attrs were not transferred (see previous errors) (code 23) at main.c(1863) [Receiver=3.2.7]
rsync: [Receiver] write error: Broken pipe (32)
rsync: [sender] change_dir "/tmp/homes/builder0/build" failed: No such file or directory (2)
rsync error: some files/attrs were not transferred (see previous errors) (code 23) at main.c(1863) [Receiver=3.2.7]
rsync: [Receiver] write error: Broken pipe (32)
rsync: [sender] change_dir "/tmp/homes/builder0/build" failed: No such file or directory (2)
rsync error: some files/attrs were not transferred (see previous errors) (code 23) at main.c(1863) [Receiver=3.2.7]
rsync: [Receiver] write error: Broken pipe (32)
rsync: [sender] change_dir "/tmp/homes/builder0/build" failed: No such file or directory (2)
rsync error: some files/attrs were not transferred (see previous errors) (code 23) at main.c(1863) [Receiver=3.2.7]
rsync: [Receiver] write error: Broken pipe (32)
rsync: [sender] change_dir "/tmp/homes/builder0/build" failed: No such file or directory (2)
rsync error: some files/attrs were not transferred (see previous errors) (code 23) at main.c(1863) [Receiver=3.2.7]
rsync: [Receiver] write error: Broken pipe (32)
rsync: [sender] change_dir "/tmp/homes/builder0/build" failed: No such file or directory (2)
rsync error: some files/attrs were not transferred (see previous errors) (code 23) at main.c(1863) [Receiver=3.2.7]
rsync: [Receiver] write error: Broken pipe (32)
rsync: [sender] change_dir "/tmp/homes/builder0/build" failed: No such file or directory (2)
rsync error: some files/attrs were not transferred (see previous errors) (code 23) at main.c(1863) [Receiver=3.2.7]
rsync: [Receiver] write error: Broken pipe (32)
rsync: [sender] change_dir "/tmp/homes/builder0/build" failed: No such file or directory (2)
rsync error: some files/attrs were not transferred (see previous errors) (code 23) at main.c(1863) [Receiver=3.2.7]
rsync: [Receiver] write error: Broken pipe (32)
rsync: [sender] change_dir "/tmp/homes/builder0/build" failed: No such file or directory (2)
rsync error: some files/attrs were not transferred (see previous errors) (code 23) at main.c(1863) [Receiver=3.2.7]
rsync: [Receiver] write error: Broken pipe (32)
rsync: [sender] change_dir "/tmp/homes/builder0/build" failed: No such file or directory (2)
rsync error: some files/attrs were not transferred (see previous errors) (code 23) at main.c(1863) [Receiver=3.2.7]
rsync: [Receiver] write error: Broken pipe (32)
rsync: [sender] change_dir "/tmp/homes/builder0/build" failed: No such file or directory (2)
rsync error: some files/attrs were not transferred (see previous errors) (code 23) at main.c(1863) [Receiver=3.2.7]
rsync: [Receiver] write error: Broken pipe (32)
rsync: [sender] change_dir "/tmp/homes/builder0/build" failed: No such file or directory (2)
rsync error: some files/attrs were not transferred (see previous errors) (code 23) at main.c(1863) [Receiver=3.2.7]
rsync: [Receiver] write error: Broken pipe (32)
rsync: [sender] change_dir "/tmp/homes/builder0/build" failed: No such file or directory (2)
rsync error: some files/attrs were not transferred (see previous errors) (code 23) at main.c(1863) [Receiver=3.2.7]
rsync: [Receiver] write error: Broken pipe (32)
rsync: [sender] change_dir "/tmp/homes/builder0/build" failed: No such file or directory (2)
rsync error: some files/attrs were not transferred (see previous errors) (code 23) at main.c(1863) [Receiver=3.2.7]
rsync: [Receiver] write error: Broken pipe (32)
rsync: [sender] change_dir "/tmp/homes/builder0/build" failed: No such file or directory (2)
rsync error: some files/attrs were not transferred (see previous errors) (code 23) at main.c(1863) [Receiver=3.2.7]
rsync: [Receiver] write error: Broken pipe (32)
rsync: [sender] change_dir "/tmp/homes/builder0/build" failed: No such file or directory (2)
rsync error: some files/attrs were not transferred (see previous errors) (code 23) at main.c(1863) [Receiver=3.2.7]
rsync: [Receiver] write error: Broken pipe (32)
rsync: [sender] change_dir "/tmp/homes/builder0/build" failed: No such file or directory (2)
rsync error: some files/attrs were not transferred (see previous errors) (code 23) at main.c(1863) [Receiver=3.2.7]
rsync: [Receiver] write error: Broken pipe (32)
rsync: [sender] change_dir "/tmp/homes/builder0/build" failed: No such file or directory (2)
rsync error: some files/attrs were not transferred (see previous errors) (code 23) at main.c(1863) [Receiver=3.2.7]
rsync: [Receiver] write error: Broken pipe (32)
rsync: [sender] change_dir "/tmp/homes/builder0/build" failed: No such file or directory (2)
rsync error: some files/attrs were not transferred (see previous errors) (code 23) at main.c(1863) [Receiver=3.2.7]
rsync: [Receiver] write error: Broken pipe (32)
rsync: [sender] change_dir "/tmp/homes/builder0/build" failed: No such file or directory (2)
rsync error: some files/attrs were not transferred (see previous errors) (code 23) at main.c(1863) [Receiver=3.2.7]
rsync: [Receiver] write error: Broken pipe (32)
rsync: [sender] change_dir "/tmp/homes/builder0/build" failed: No such file or directory (2)
rsync error: some files/attrs were not transferred (see previous errors) (code 23) at main.c(1863) [Receiver=3.2.7]
rsync: [Receiver] write error: Broken pipe (32)
rsync: [sender] change_dir "/tmp/homes/builder0/build" failed: No such file or directory (2)
rsync error: some files/attrs were not transferred (see previous errors) (code 23) at main.c(1863) [Receiver=3.2.7]
rsync: [Receiver] write error: Broken pipe (32)
rsync: [sender] change_dir "/tmp/homes/builder0/build" failed: No such file or directory (2)
rsync error: some files/attrs were not transferred (see previous errors) (code 23) at main.c(1863) [Receiver=3.2.7]
rsync: [Receiver] write error: Broken pipe (32)
rsync: [sender] change_dir "/tmp/homes/builder0/build" failed: No such file or directory (2)
rsync error: some files/attrs were not transferred (see previous errors) (code 23) at main.c(1863) [Receiver=3.2.7]
rsync: [Receiver] write error: Broken pipe (32)
rsync: [sender] change_dir "/tmp/homes/builder0/build" failed: No such file or directory (2)
rsync error: some files/attrs were not transferred (see previous errors) (code 23) at main.c(1863) [Receiver=3.2.7]
rsync: [Receiver] write error: Broken pipe (32)
rsync: [sender] change_dir "/tmp/homes/builder0/build" failed: No such file or directory (2)
rsync error: some files/attrs were not transferred (see previous errors) (code 23) at main.c(1863) [Receiver=3.2.7]
rsync: [Receiver] write error: Broken pipe (32)
rsync: [sender] change_dir "/tmp/homes/builder0/build" failed: No such file or directory (2)
rsync error: some files/attrs were not transferred (see previous errors) (code 23) at main.c(1863) [Receiver=3.2.7]
rsync: [Receiver] write error: Broken pipe (32)
rsync: [sender] change_dir "/tmp/homes/builder0/build" failed: No such file or directory (2)
rsync error: some files/attrs were not transferred (see previous errors) (code 23) at main.c(1863) [Receiver=3.2.7]
rsync: [Receiver] write error: Broken pipe (32)
rsync: [sender] change_dir "/tmp/homes/builder0/build" failed: No such file or directory (2)
rsync error: some files/attrs were not transferred (see previous errors) (code 23) at main.c(1863) [Receiver=3.2.7]
rsync: [Receiver] write error: Broken pipe (32)
rsync: [sender] change_dir "/tmp/homes/builder0/build" failed: No such file or directory (2)
rsync error: some files/attrs were not transferred (see previous errors) (code 23) at main.c(1863) [Receiver=3.2.7]
rsync: [Receiver] write error: Broken pipe (32)
rsync: [sender] change_dir "/tmp/homes/builder0/build" failed: No such file or directory (2)
rsync error: some files/attrs were not transferred (see previous errors) (code 23) at main.c(1863) [Receiver=3.2.7]
rsync: [Receiver] write error: Broken pipe (32)
rsync: [sender] change_dir "/tmp/homes/builder0/build" failed: No such file or directory (2)
rsync error: some files/attrs were not transferred (see previous errors) (code 23) at main.c(1863) [Receiver=3.2.7]
rsync: [Receiver] write error: Broken pipe (32)
rsync: [sender] change_dir "/tmp/homes/builder0/build" failed: No such file or directory (2)
rsync error: some files/attrs were not transferred (see previous errors) (code 23) at main.c(1863) [Receiver=3.2.7]
rsync: [Receiver] write error: Broken pipe (32)
rsync: [sender] change_dir "/tmp/homes/builder0/build" failed: No such file or directory (2)
rsync error: some files/attrs were not transferred (see previous errors) (code 23) at main.c(1863) [Receiver=3.2.7]
rsync: [Receiver] write error: Broken pipe (32)
rsync: [sender] change_dir "/tmp/homes/builder0/build" failed: No such file or directory (2)
rsync error: some files/attrs were not transferred (see previous errors) (code 23) at main.c(1863) [Receiver=3.2.7]
rsync: [Receiver] write error: Broken pipe (32)
rsync: [sender] change_dir "/tmp/homes/builder0/build" failed: No such file or directory (2)
rsync error: some files/attrs were not transferred (see previous errors) (code 23) at main.c(1863) [Receiver=3.2.7]
rsync: [Receiver] write error: Broken pipe (32)
rsync: [sender] change_dir "/tmp/homes/builder0/build" failed: No such file or directory (2)
rsync error: some files/attrs were not transferred (see previous errors) (code 23) at main.c(1863) [Receiver=3.2.7]
rsync: [Receiver] write error: Broken pipe (32)
rsync: [sender] change_dir "/tmp/homes/builder0/build" failed: No such file or directory (2)
rsync error: some files/attrs were not transferred (see previous errors) (code 23) at main.c(1863) [Receiver=3.2.7]
rsync: [Receiver] write error: Broken pipe (32)
rsync: [sender] change_dir "/tmp/homes/builder0/build" failed: No such file or directory (2)
rsync error: some files/attrs were not transferred (see previous errors) (code 23) at main.c(1863) [Receiver=3.2.7]
rsync: [Receiver] write error: Broken pipe (32)
rsync: [sender] change_dir "/tmp/homes/builder0/build" failed: No such file or directory (2)
rsync error: some files/attrs were not transferred (see previous errors) (code 23) at main.c(1863) [Receiver=3.2.7]
rsync: [Receiver] write error: Broken pipe (32)
rsync: [sender] change_dir "/tmp/homes/builder0/build" failed: No such file or directory (2)
rsync error: some files/attrs were not transferred (see previous errors) (code 23) at main.c(1863) [Receiver=3.2.7]
rsync: [Receiver] write error: Broken pipe (32)
rsync: [sender] change_dir "/tmp/homes/builder0/build" failed: No such file or directory (2)
rsync error: some files/attrs were not transferred (see previous errors) (code 23) at main.c(1863) [Receiver=3.2.7]
rsync: [Receiver] write error: Broken pipe (32)
rsync: [sender] change_dir "/tmp/homes/builder0/build" failed: No such file or directory (2)
rsync error: some files/attrs were not transferred (see previous errors) (code 23) at main.c(1863) [Receiver=3.2.7]
rsync: [Receiver] write error: Broken pipe (32)
rsync: [sender] change_dir "/tmp/homes/builder0/build" failed: No such file or directory (2)
rsync error: some files/attrs were not transferred (see previous errors) (code 23) at main.c(1863) [Receiver=3.2.7]
rsync: [Receiver] write error: Broken pipe (32)
rsync: [sender] change_dir "/tmp/homes/builder0/build" failed: No such file or directory (2)
rsync error: some files/attrs were not transferred (see previous errors) (code 23) at main.c(1863) [Receiver=3.2.7]
rsync: [Receiver] write error: Broken pipe (32)
rsync: [sender] change_dir "/tmp/homes/builder0/build" failed: No such file or directory (2)
rsync error: some files/attrs were not transferred (see previous errors) (code 23) at main.c(1863) [Receiver=3.2.7]
rsync: [Receiver] write error: Broken pipe (32)
rsync: [sender] change_dir "/tmp/homes/builder0/build" failed: No such file or directory (2)
rsync error: some files/attrs were not transferred (see previous errors) (code 23) at main.c(1863) [Receiver=3.2.7]
rsync: [Receiver] write error: Broken pipe (32)
rsync: [sender] change_dir "/tmp/homes/builder0/build" failed: No such file or directory (2)
rsync error: some files/attrs were not transferred (see previous errors) (code 23) at main.c(1863) [Receiver=3.2.7]
rsync: [Receiver] write error: Broken pipe (32)
rsync: [sender] change_dir "/tmp/homes/builder0/build" failed: No such file or directory (2)
rsync error: some files/attrs were not transferred (see previous errors) (code 23) at main.c(1863) [Receiver=3.2.7]
rsync: [Receiver] write error: Broken pipe (32)
rsync: [sender] change_dir "/tmp/homes/builder0/build" failed: No such file or directory (2)
rsync error: some files/attrs were not transferred (see previous errors) (code 23) at main.c(1863) [Receiver=3.2.7]
rsync: [Receiver] write error: Broken pipe (32)
rsync: [sender] change_dir "/tmp/homes/builder0/build" failed: No such file or directory (2)
rsync error: some files/attrs were not transferred (see previous errors) (code 23) at main.c(1863) [Receiver=3.2.7]
rsync: [Receiver] write error: Broken pipe (32)
rsync: [sender] change_dir "/tmp/homes/builder0/build" failed: No such file or directory (2)
rsync error: some files/attrs were not transferred (see previous errors) (code 23) at main.c(1863) [Receiver=3.2.7]
rsync: [Receiver] write error: Broken pipe (32)
rsync: [sender] change_dir "/tmp/homes/builder0/build" failed: No such file or directory (2)
rsync error: some files/attrs were not transferred (see previous errors) (code 23) at main.c(1863) [Receiver=3.2.7]
rsync: [Receiver] write error: Broken pipe (32)
rsync: [sender] change_dir "/tmp/homes/builder0/build" failed: No such file or directory (2)
rsync error: some files/attrs were not transferred (see previous errors) (code 23) at main.c(1863) [Receiver=3.2.7]
rsync: [Receiver] write error: Broken pipe (32)
rsync: [sender] change_dir "/tmp/homes/builder0/build" failed: No such file or directory (2)
rsync error: some files/attrs were not transferred (see previous errors) (code 23) at main.c(1863) [Receiver=3.2.7]
rsync: [Receiver] write error: Broken pipe (32)
rsync: [sender] change_dir "/tmp/homes/builder0/build" failed: No such file or directory (2)
rsync error: some files/attrs were not transferred (see previous errors) (code 23) at main.c(1863) [Receiver=3.2.7]
rsync: [Receiver] write error: Broken pipe (32)
rsync: [sender] change_dir "/tmp/homes/builder0/build" failed: No such file or directory (2)
rsync error: some files/attrs were not transferred (see previous errors) (code 23) at main.c(1863) [Receiver=3.2.7]
rsync: [Receiver] write error: Broken pipe (32)
rsync: [sender] change_dir "/tmp/homes/builder0/build" failed: No such file or directory (2)
rsync error: some files/attrs were not transferred (see previous errors) (code 23) at main.c(1863) [Receiver=3.2.7]
rsync: [Receiver] write error: Broken pipe (32)
rsync: [sender] change_dir "/tmp/homes/builder0/build" failed: No such file or directory (2)
rsync error: some files/attrs were not transferred (see previous errors) (code 23) at main.c(1863) [Receiver=3.2.7]
rsync: [Receiver] write error: Broken pipe (32)
rsync: [sender] change_dir "/tmp/homes/builder0/build" failed: No such file or directory (2)
rsync error: some files/attrs were not transferred (see previous errors) (code 23) at main.c(1863) [Receiver=3.2.7]
rsync: [Receiver] write error: Broken pipe (32)
rsync: [sender] change_dir "/tmp/homes/builder0/build" failed: No such file or directory (2)
rsync error: some files/attrs were not transferred (see previous errors) (code 23) at main.c(1863) [Receiver=3.2.7]
rsync: [Receiver] write error: Broken pipe (32)
rsync: [sender] change_dir "/tmp/homes/builder0/build" failed: No such file or directory (2)
rsync error: some files/attrs were not transferred (see previous errors) (code 23) at main.c(1863) [Receiver=3.2.7]
rsync: [Receiver] write error: Broken pipe (32)
rsync: [sender] change_dir "/tmp/homes/builder0/build" failed: No such file or directory (2)
rsync error: some files/attrs were not transferred (see previous errors) (code 23) at main.c(1863) [Receiver=3.2.7]
rsync: [Receiver] write error: Broken pipe (32)
rsync: [sender] change_dir "/tmp/homes/builder0/build" failed: No such file or directory (2)
rsync error: some files/attrs were not transferred (see previous errors) (code 23) at main.c(1863) [Receiver=3.2.7]
rsync: [Receiver] write error: Broken pipe (32)
rsync: [sender] change_dir "/tmp/homes/builder0/build" failed: No such file or directory (2)
rsync error: some files/attrs were not transferred (see previous errors) (code 23) at main.c(1863) [Receiver=3.2.7]
rsync: [Receiver] write error: Broken pipe (32)
rsync: [sender] change_dir "/tmp/homes/builder0/build" failed: No such file or directory (2)
rsync error: some files/attrs were not transferred (see previous errors) (code 23) at main.c(1863) [Receiver=3.2.7]
rsync: [Receiver] write error: Broken pipe (32)
rsync: [sender] change_dir "/tmp/homes/builder0/build" failed: No such file or directory (2)
rsync error: some files/attrs were not transferred (see previous errors) (code 23) at main.c(1863) [Receiver=3.2.7]
rsync: [Receiver] write error: Broken pipe (32)
rsync: [sender] change_dir "/tmp/homes/builder0/build" failed: No such file or directory (2)
rsync error: some files/attrs were not transferred (see previous errors) (code 23) at main.c(1863) [Receiver=3.2.7]
rsync: [Receiver] write error: Broken pipe (32)
rsync: [sender] change_dir "/tmp/homes/builder0/build" failed: No such file or directory (2)
rsync error: some files/attrs were not transferred (see previous errors) (code 23) at main.c(1863) [Receiver=3.2.7]
rsync: [Receiver] write error: Broken pipe (32)
rsync: [sender] change_dir "/tmp/homes/builder0/build" failed: No such file or directory (2)
rsync error: some files/attrs were not transferred (see previous errors) (code 23) at main.c(1863) [Receiver=3.2.7]
rsync: [Receiver] write error: Broken pipe (32)
rsync: [sender] change_dir "/tmp/homes/builder0/build" failed: No such file or directory (2)
rsync error: some files/attrs were not transferred (see previous errors) (code 23) at main.c(1863) [Receiver=3.2.7]
rsync: [Receiver] write error: Broken pipe (32)
rsync: [sender] change_dir "/tmp/homes/builder0/build" failed: No such file or directory (2)
rsync error: some files/attrs were not transferred (see previous errors) (code 23) at main.c(1863) [Receiver=3.2.7]
rsync: [Receiver] write error: Broken pipe (32)
rsync: [sender] change_dir "/tmp/homes/builder0/build" failed: No such file or directory (2)
rsync error: some files/attrs were not transferred (see previous errors) (code 23) at main.c(1863) [Receiver=3.2.7]
rsync: [Receiver] write error: Broken pipe (32)
rsync: [sender] change_dir "/tmp/homes/builder0/build" failed: No such file or directory (2)
rsync error: some files/attrs were not transferred (see previous errors) (code 23) at main.c(1863) [Receiver=3.2.7]
rsync: [Receiver] write error: Broken pipe (32)
rsync: [sender] change_dir "/tmp/homes/builder0/build" failed: No such file or directory (2)
rsync error: some files/attrs were not transferred (see previous errors) (code 23) at main.c(1863) [Receiver=3.2.7]
rsync: [Receiver] write error: Broken pipe (32)
rsync: [sender] change_dir "/tmp/homes/builder0/build" failed: No such file or directory (2)
rsync error: some files/attrs were not transferred (see previous errors) (code 23) at main.c(1863) [Receiver=3.2.7]
rsync: [Receiver] write error: Broken pipe (32)
rsync: [sender] change_dir "/tmp/homes/builder0/build" failed: No such file or directory (2)
rsync error: some files/attrs were not transferred (see previous errors) (code 23) at main.c(1863) [Receiver=3.2.7]
rsync: [Receiver] write error: Broken pipe (32)
rsync: [sender] change_dir "/tmp/homes/builder0/build" failed: No such file or directory (2)
rsync error: some files/attrs were not transferred (see previous errors) (code 23) at main.c(1863) [Receiver=3.2.7]
rsync: [Receiver] write error: Broken pipe (32)
rsync: [sender] change_dir "/tmp/homes/builder0/build" failed: No such file or directory (2)
rsync error: some files/attrs were not transferred (see previous errors) (code 23) at main.c(1863) [Receiver=3.2.7]
rsync: [Receiver] write error: Broken pipe (32)
rsync: [sender] change_dir "/tmp/homes/builder0/build" failed: No such file or directory (2)
rsync error: some files/attrs were not transferred (see previous errors) (code 23) at main.c(1863) [Receiver=3.2.7]
rsync: [Receiver] write error: Broken pipe (32)
rsync: [sender] change_dir "/tmp/homes/builder0/build" failed: No such file or directory (2)
rsync error: some files/attrs were not transferred (see previous errors) (code 23) at main.c(1863) [Receiver=3.2.7]
rsync: [Receiver] write error: Broken pipe (32)
rsync: [sender] change_dir "/tmp/homes/builder0/build" failed: No such file or directory (2)
rsync error: some files/attrs were not transferred (see previous errors) (code 23) at main.c(1863) [Receiver=3.2.7]
rsync: [Receiver] write error: Broken pipe (32)
rsync: [sender] change_dir "/tmp/homes/builder0/build" failed: No such file or directory (2)
rsync error: some files/attrs were not transferred (see previous errors) (code 23) at main.c(1863) [Receiver=3.2.7]
rsync: [Receiver] write error: Broken pipe (32)
rsync: [sender] change_dir "/tmp/homes/builder0/build" failed: No such file or directory (2)
rsync error: some files/attrs were not transferred (see previous errors) (code 23) at main.c(1863) [Receiver=3.2.7]
rsync: [Receiver] write error: Broken pipe (32)
rsync: [sender] change_dir "/tmp/homes/builder0/build" failed: No such file or directory (2)
rsync error: some files/attrs were not transferred (see previous errors) (code 23) at main.c(1863) [Receiver=3.2.7]
rsync: [Receiver] write error: Broken pipe (32)
rsync: [sender] change_dir "/tmp/homes/builder0/build" failed: No such file or directory (2)
rsync error: some files/attrs were not transferred (see previous errors) (code 23) at main.c(1863) [Receiver=3.2.7]
rsync: [Receiver] write error: Broken pipe (32)
rsync: [sender] change_dir "/tmp/homes/builder0/build" failed: No such file or directory (2)
rsync error: some files/attrs were not transferred (see previous errors) (code 23) at main.c(1863) [Receiver=3.2.7]
rsync: [Receiver] write error: Broken pipe (32)
rsync: [sender] change_dir "/tmp/homes/builder0/build" failed: No such file or directory (2)
rsync error: some files/attrs were not transferred (see previous errors) (code 23) at main.c(1863) [Receiver=3.2.7]
rsync: [Receiver] write error: Broken pipe (32)
rsync: [sender] change_dir "/tmp/homes/builder0/build" failed: No such file or directory (2)
rsync error: some files/attrs were not transferred (see previous errors) (code 23) at main.c(1863) [Receiver=3.2.7]
rsync: [Receiver] write error: Broken pipe (32)
rsync: [sender] change_dir "/tmp/homes/builder0/build" failed: No such file or directory (2)
rsync error: some files/attrs were not transferred (see previous errors) (code 23) at main.c(1863) [Receiver=3.2.7]
rsync: [Receiver] write error: Broken pipe (32)
rsync: [sender] change_dir "/tmp/homes/builder0/build" failed: No such file or directory (2)
rsync error: some files/attrs were not transferred (see previous errors) (code 23) at main.c(1863) [Receiver=3.2.7]
rsync: [Receiver] write error: Broken pipe (32)
rsync: [sender] change_dir "/tmp/homes/builder0/build" failed: No such file or directory (2)
rsync error: some files/attrs were not transferred (see previous errors) (code 23) at main.c(1863) [Receiver=3.2.7]
rsync: [Receiver] write error: Broken pipe (32)
rsync: [sender] change_dir "/tmp/homes/builder0/build" failed: No such file or directory (2)
rsync error: some files/attrs were not transferred (see previous errors) (code 23) at main.c(1863) [Receiver=3.2.7]
rsync: [Receiver] write error: Broken pipe (32)
rsync: [sender] change_dir "/tmp/homes/builder0/build" failed: No such file or directory (2)
rsync error: some files/attrs were not transferred (see previous errors) (code 23) at main.c(1863) [Receiver=3.2.7]
rsync: [Receiver] write error: Broken pipe (32)
rsync: [sender] change_dir "/tmp/homes/builder0/build" failed: No such file or directory (2)
rsync error: some files/attrs were not transferred (see previous errors) (code 23) at main.c(1863) [Receiver=3.2.7]
rsync: [Receiver] write error: Broken pipe (32)
rsync: [sender] change_dir "/tmp/homes/builder0/build" failed: No such file or directory (2)
rsync error: some files/attrs were not transferred (see previous errors) (code 23) at main.c(1863) [Receiver=3.2.7]
rsync: [Receiver] write error: Broken pipe (32)
rsync: [sender] change_dir "/tmp/homes/builder0/build" failed: No such file or directory (2)
rsync error: some files/attrs were not transferred (see previous errors) (code 23) at main.c(1863) [Receiver=3.2.7]
rsync: [Receiver] write error: Broken pipe (32)
rsync: [sender] change_dir "/tmp/homes/builder0/build" failed: No such file or directory (2)
rsync error: some files/attrs were not transferred (see previous errors) (code 23) at main.c(1863) [Receiver=3.2.7]
rsync: [Receiver] write error: Broken pipe (32)
rsync: [sender] change_dir "/tmp/homes/builder0/build" failed: No such file or directory (2)
rsync error: some files/attrs were not transferred (see previous errors) (code 23) at main.c(1863) [Receiver=3.2.7]
rsync: [Receiver] write error: Broken pipe (32)
rsync: [sender] change_dir "/tmp/homes/builder0/build" failed: No such file or directory (2)
rsync error: some files/attrs were not transferred (see previous errors) (code 23) at main.c(1863) [Receiver=3.2.7]
rsync: [Receiver] write error: Broken pipe (32)
rsync: [sender] change_dir "/tmp/homes/builder0/build" failed: No such file or directory (2)
rsync error: some files/attrs were not transferred (see previous errors) (code 23) at main.c(1863) [Receiver=3.2.7]
rsync: [Receiver] write error: Broken pipe (32)
rsync: [sender] change_dir "/tmp/homes/builder0/build" failed: No such file or directory (2)
rsync error: some files/attrs were not transferred (see previous errors) (code 23) at main.c(1863) [Receiver=3.2.7]
rsync: [Receiver] write error: Broken pipe (32)
rsync: [sender] change_dir "/tmp/homes/builder0/build" failed: No such file or directory (2)
rsync error: some files/attrs were not transferred (see previous errors) (code 23) at main.c(1863) [Receiver=3.2.7]
rsync: [Receiver] write error: Broken pipe (32)
rsync: [sender] change_dir "/tmp/homes/builder0/build" failed: No such file or directory (2)
rsync error: some files/attrs were not transferred (see previous errors) (code 23) at main.c(1863) [Receiver=3.2.7]
rsync: [Receiver] write error: Broken pipe (32)
rsync: [sender] change_dir "/tmp/homes/builder0/build" failed: No such file or directory (2)
rsync error: some files/attrs were not transferred (see previous errors) (code 23) at main.c(1863) [Receiver=3.2.7]
rsync: [Receiver] write error: Broken pipe (32)
rsync: [sender] change_dir "/tmp/homes/builder0/build" failed: No such file or directory (2)
rsync error: some files/attrs were not transferred (see previous errors) (code 23) at main.c(1863) [Receiver=3.2.7]
rsync: [Receiver] write error: Broken pipe (32)
rsync: [sender] change_dir "/tmp/homes/builder0/build" failed: No such file or directory (2)
rsync error: some files/attrs were not transferred (see previous errors) (code 23) at main.c(1863) [Receiver=3.2.7]
rsync: [Receiver] write error: Broken pipe (32)
rsync: [sender] change_dir "/tmp/homes/builder0/build" failed: No such file or directory (2)
rsync error: some files/attrs were not transferred (see previous errors) (code 23) at main.c(1863) [Receiver=3.2.7]
rsync: [Receiver] write error: Broken pipe (32)
gb-x-rsync-loop: all attempts failed
2026-Jul-07 01:52:48 :: [riscv64] build FAILED
2026-Jul-07 01:52:48 :: task #131727 for sisyphus_riscv64 FAILED
More information about the Riscv-reports
mailing list