[riscv-reports] [#131639] sisyphus_riscv64 FAILED srpm=opensearch-3.6.0-alt5.src.rpm
Girar sisyphus_riscv64 awaiter recycler
noreply at basealt.ru
Mon Jul 6 19:31:30 MSK 2026
http://web.build.srt.basealt.ru/tasks/131639/logs/events.1.1.log
2026-Jul-06 16:29:12 :: shared task #131639 for sisyphus_riscv64 started by recycler:
2026-Jul-06 16:29:12 :: message: sync
#100 build opensearch-3.6.0-alt5.src.rpm
2026-Jul-06 16:29:19 :: [riscv64] #100 opensearch-3.6.0-alt5.src.rpm: build start
2026-Jul-06 16:31:28 :: [riscv64] #100 opensearch-3.6.0-alt5.src.rpm: build SKIPPED
2026-Jul-06 16:31:30 :: #100: opensearch-3.6.0-alt5.src.rpm: no source package
2026-Jul-06 16:31:30 :: build check FAILED for: #100
2026-Jul-06 16:31:30 :: task #131639 for sisyphus_riscv64 FAILED
More information about the Riscv-reports
mailing list