[riscv-reports] [#131591] sisyphus_riscv64 FAILED srpm=qgis-4.2.0-alt1.src.rpm

Girar sisyphus_riscv64 awaiter recycler noreply at basealt.ru
Mon Jul 6 17:09:11 MSK 2026


http://web.build.srt.basealt.ru/tasks/131591/logs/events.1.1.log

subtask  name  riscv64
   #100  qgis   failed

2026-Jul-06 11:09:50 :: shared task #131591 for sisyphus_riscv64 started by recycler:
2026-Jul-06 11:09:50 :: message: sync
#100 build qgis-4.2.0-alt1.src.rpm
2026-Jul-06 11:09:56 :: [riscv64] #100 qgis-4.2.0-alt1.src.rpm: build start
[riscv64] -- Installing: /usr/src/tmp/qgis-buildroot/usr/share/qgis/FindQGIS.cmake
[riscv64] /usr/src/RPM/BUILD/qgis-4.2.0/output/bin/crssync: error while loading shared libraries: libqgis_core.so.4.2.0: cannot open shared object file: No such file or directory
[riscv64] -- Installing: /usr/src/tmp/qgis-buildroot/usr/share/icons/hicolor/scalable/apps/qgis.svg
[riscv64] --
[riscv64] + sed -i /QtWebEngine/d /usr/src/tmp/qgis-buildroot/usr/share/qgis/python/qsci_apis/PyQt6.api
[riscv64] sed: can't read /usr/src/tmp/qgis-buildroot/usr/share/qgis/python/qsci_apis/PyQt6.api: No such file or directory
[riscv64] error: Bad exit status from /usr/src/tmp/rpmb-tmp.m3yflK (%install)
2026-Jul-06 14:09:10 :: [riscv64] qgis-4.2.0-alt1.src.rpm: remote: build failed
2026-Jul-06 14:09:10 :: [riscv64] #100 qgis-4.2.0-alt1.src.rpm: build FAILED
2026-Jul-06 14:09:10 :: [riscv64] requesting cancellation of task processing
2026-Jul-06 14:09:11 :: [riscv64] build FAILED
2026-Jul-06 14:09:11 :: task #131591 for sisyphus_riscv64 FAILED


More information about the Riscv-reports mailing list