[riscv-reports] [#131441] sisyphus_riscv64 FAILED srpm=kdevelop-26.04.3-alt1.src.rpm

Girar sisyphus_riscv64 awaiter recycler noreply at basealt.ru
Sun Jul 5 18:49:13 MSK 2026


http://web.build.srt.basealt.ru/tasks/131441/logs/events.1.1.log

2026-Jul-05 15:47:53 :: shared task #131441 for sisyphus_riscv64 started by recycler:
2026-Jul-05 15:47:53 :: message: sync
#100 build kdevelop-26.04.3-alt1.src.rpm
2026-Jul-05 15:48:07 :: [riscv64] #100 kdevelop-26.04.3-alt1.src.rpm: build start
2026-Jul-05 15:49:13 :: [riscv64] #100 kdevelop-26.04.3-alt1.src.rpm: build SKIPPED
2026-Jul-05 15:49:13 :: #100: kdevelop-26.04.3-alt1.src.rpm: no source package
2026-Jul-05 15:49:13 :: build check FAILED for: #100 
2026-Jul-05 15:49:13 :: task #131441 for sisyphus_riscv64 FAILED


More information about the Riscv-reports mailing list