[riscv-reports] [#131419] sisyphus_riscv64 FAILED srpm=task-edu-1.8.2-alt1.src.rpm
Girar sisyphus_riscv64 awaiter recycler
noreply at basealt.ru
Sun Jul 5 16:13:52 MSK 2026
http://web.build.srt.basealt.ru/tasks/131419/logs/events.1.1.log
subtask name riscv64
#100 task-edu 1:37
2026-Jul-05 13:11:01 :: shared task #131419 for sisyphus_riscv64 started by recycler:
2026-Jul-05 13:11:01 :: message: sync
#100 build task-edu-1.8.2-alt1.src.rpm
2026-Jul-05 13:11:09 :: [riscv64] #100 task-edu-1.8.2-alt1.src.rpm: build start
2026-Jul-05 13:12:46 :: [riscv64] #100 task-edu-1.8.2-alt1.src.rpm: build OK
2026-Jul-05 13:12:48 :: 100: build check OK
2026-Jul-05 13:12:48 :: build check OK
2026-Jul-05 13:12:49 :: #100: task-edu-1.8.2-alt1.src.rpm: version check OK
2026-Jul-05 13:12:49 :: build version check OK
2026-Jul-05 13:12:49 :: noarch check OK
2026-Jul-05 13:12:50 :: plan: src +1 -0 =21211, riscv64 +12 -0 =37567
2026-Jul-05 13:13:15 :: patched apt indices
2026-Jul-05 13:13:17 :: created next repo
2026-Jul-05 13:13:27 :: duplicate provides check OK
riscv64: NEW unmet dependencies detected:
task-edu-lite#1.8.2-alt1:sisyphus_riscv64+131419.100.1.1 at 1783257158 calibre
task-edu-lite#1.8.2-alt1:sisyphus_riscv64+131419.100.1.1 at 1783257158 goldendict-ng
task-edu-lite#1.8.2-alt1:sisyphus_riscv64+131419.100.1.1 at 1783257158 netpolice-main
task-edu-secondary-vocational#1.8.2-alt1:sisyphus_riscv64+131419.100.1.1 at 1783257158 qt-creator
task-edu-secondary-vocational#1.8.2-alt1:sisyphus_riscv64+131419.100.1.1 at 1783257158 qt-creator-doc
task-edu-university#1.8.2-alt1:sisyphus_riscv64+131419.100.1.1 at 1783257158 qgis
task-edu-university#1.8.2-alt1:sisyphus_riscv64+131419.100.1.1 at 1783257158 qgis-grass
task-edu-university#1.8.2-alt1:sisyphus_riscv64+131419.100.1.1 at 1783257158 qgis-python
task-edu-university#1.8.2-alt1:sisyphus_riscv64+131419.100.1.1 at 1783257158 qt-creator
task-edu-university#1.8.2-alt1:sisyphus_riscv64+131419.100.1.1 at 1783257158 qt-creator-doc
ACLs of affected packages (1):
task-edu
2026-Jul-05 13:13:52 :: unmets: riscv64 +10 -0 =10
2026-Jul-05 13:13:52 :: dependencies check FAILED
2026-Jul-05 13:13:52 :: task #131419 for sisyphus_riscv64 FAILED
More information about the Riscv-reports
mailing list