[riscv-reports] [#131363] sisyphus_riscv64 FAILED srpm=chromium-150.0.7871.46-alt1.src.rpm
Girar sisyphus_riscv64 awaiter recycler
noreply at basealt.ru
Sat Jul 4 19:06:01 MSK 2026
http://web.build.srt.basealt.ru/tasks/131363/logs/events.1.1.log
2026-Jul-04 16:02:45 :: shared task #131363 for sisyphus_riscv64 started by recycler:
2026-Jul-04 16:02:45 :: message: sync
#100 build chromium-150.0.7871.46-alt1.src.rpm
2026-Jul-04 16:02:52 :: [riscv64] #100 chromium-150.0.7871.46-alt1.src.rpm: build start
2026-Jul-04 16:05:54 :: [riscv64] #100 chromium-150.0.7871.46-alt1.src.rpm: build SKIPPED
2026-Jul-04 16:06:01 :: #100: chromium-150.0.7871.46-alt1.src.rpm: no source package
2026-Jul-04 16:06:01 :: build check FAILED for: #100
2026-Jul-04 16:06:01 :: task #131363 for sisyphus_riscv64 FAILED
More information about the Riscv-reports
mailing list