[riscv-reports] [#131320] sisyphus_riscv64 FAILED srpm=openjph-0.30.1-alt1.src.rpm srpm=openexr-3.4.12-alt1.src.rpm ...
Girar sisyphus_riscv64 awaiter recycler
noreply at basealt.ru
Sat Jul 4 10:58:21 MSK 2026
http://web.build.srt.basealt.ru/tasks/131320/logs/events.1.1.log
subtask name riscv64
#100 openjph 4:44
#200 openexr 15:26
#300 libopenimageio failed
2026-Jul-04 06:56:39 :: shared task #131320 for sisyphus_riscv64 started by recycler:
2026-Jul-04 06:56:39 :: message: sync
#100 build openjph-0.30.1-alt1.src.rpm
#200 build openexr-3.4.12-alt1.src.rpm
#300 build libopenimageio-3.1.14.1-alt1.src.rpm
2026-Jul-04 06:56:39 :: created build repo
2026-Jul-04 06:56:47 :: [riscv64] #100 openjph-0.30.1-alt1.src.rpm: build start
2026-Jul-04 07:01:31 :: [riscv64] #100 openjph-0.30.1-alt1.src.rpm: build OK
2026-Jul-04 07:01:31 :: [riscv64] #200 openexr-3.4.12-alt1.src.rpm: build start
2026-Jul-04 07:16:57 :: [riscv64] #200 openexr-3.4.12-alt1.src.rpm: build OK
2026-Jul-04 07:16:57 :: [riscv64] #300 libopenimageio-3.1.14.1-alt1.src.rpm: build start
[riscv64] Total time: 4m 54.0s
[riscv64] ERRORS!
[riscv64] 142/143 Test #4: oiiotool ................................ Passed 384.63 sec
[riscv64] 143/143 Test #118: unit_atomic ............................. Passed 694.36 sec
[riscv64] 99% tests passed, 2 tests failed out of 143
[riscv64] Total Test time (real) = 766.91 sec
[riscv64] The following tests FAILED:
[riscv64] 23 - maketx (Failed)
2026-Jul-04 07:58:20 :: [riscv64] libopenimageio-3.1.14.1-alt1.src.rpm: remote: build failed
2026-Jul-04 07:58:20 :: [riscv64] #300 libopenimageio-3.1.14.1-alt1.src.rpm: build FAILED
2026-Jul-04 07:58:20 :: [riscv64] requesting cancellation of task processing
2026-Jul-04 07:58:21 :: [riscv64] build FAILED
2026-Jul-04 07:58:21 :: task #131320 for sisyphus_riscv64 FAILED
More information about the Riscv-reports
mailing list