[riscv-reports] [#131046] [test-only] sisyphus_riscv64 FAILED (try 2) srpm=libabseil-cpp-20260526.0-alt1.src.rpm srpm=ton-2026.04-alt1.src.rpm ...

Girar sisyphus_riscv64 awaiter iv noreply at basealt.ru
Thu Jul 2 14:28:37 MSK 2026


http://web.build.srt.basealt.ru/tasks/131046/logs/events.2.1.log

subtask  name                   riscv64
   #700  protobuf                failed
  #1000  python3-module-grpcio    20:38
  #1100  hyprland                 13:49
  #1200  grpc                    failed
  #1300  protobuf-c              failed
  #1400  onnx                    failed
  #1500  gz-msgs                 failed
  #1600  libprotobuf-mutator     failed
  #1700  usbguard                failed
  #2000  mosh                    failed
  #2100  osmpbf                  failed
  #2200  purple-whatsapp          11:10
  #2300  vlc                     failed

2026-Jul-02 07:38:33 :: test-only shared task #131046 for sisyphus_riscv64 resumed by iv:
2026-Jul-02 07:38:33 :: message: sync
#100 build libabseil-cpp-20260526.0-alt1.src.rpm
#200 build ton-2026.04-alt1.src.rpm
#300 build libwebrtc-audio-processing-1.3-alt3.src.rpm
#400 build libre2-20251105-alt1.src.rpm
#500 build clickhouse-cpp-2.6.2-alt1.src.rpm
#600 build libwebrtc-audio-processing-2-2.1-alt2.src.rpm
#700 build protobuf-31.1-alt1.1.src.rpm
#1000 build python3-module-grpcio-1.80.0-alt2.src.rpm
#1100 build hyprland-0.54.3-alt1.src.rpm
#1200 build grpc-1.80.0-alt1.1.src.rpm
#1300 build protobuf-c-1.5.2-alt1.src.rpm
#1400 build onnx-1.21.0-alt1.src.rpm
#1500 build gz-msgs-12.0.0-alt1.src.rpm
#1600 build libprotobuf-mutator-1.5-alt1.src.rpm
#1700 build usbguard-1.1.4-alt2.src.rpm
#2000 build mosh-1.4.0-alt1.2.src.rpm
#2100 build osmpbf-1.5.0-alt1_12jpp11.src.rpm
#2200 build purple-whatsapp-0.9.0-alt1.5.src.rpm
#2300 build vlc-3.0.23-alt3.src.rpm
#2400 build libopencv-4.13.0-alt1.src.rpm
#2500 build hidviz-0.2.1-alt1.src.rpm
#2600 build libphonenumber-9.0.33-alt1.src.rpm
#2700 build libowt-tg-4.3.0.15-alt1.src.rpm
#3000 build kicad-10.0.4-alt1.src.rpm
#3100 build sentencepiece-0.2.1-alt1.src.rpm
#3200 build libopentelemetry-1.22.0-alt2.src.rpm
#3300 build qt6-grpc-6.10.3-alt3.src.rpm
#3400 build bloaty-1.1-alt2.git3f36ed.src.rpm
#3500 build kismet-0.0.2023.07.R2-alt1_1.src.rpm
#3600 build python3-module-torch-cpu-2.10.0-alt1.src.rpm
#3700 build gz-transport-15.0.0-alt1.src.rpm
#4000 build rpcs3-0.0.41-alt1.src.rpm
#4100 build telegram-desktop-6.9.3-alt1.src.rpm
#4200 build apache-orc-2.3.0-alt1.src.rpm
#4300 build arrow-23.0.1-alt1.src.rpm
#4400 build libabseil-cpp2601.0.0-20260107.1-alt2.src.rpm
#4500 build MySQL-8.4.10-alt1.src.rpm
#4600 build icinga2-2.16.0-alt1.src.rpm
2026-Jul-02 07:38:33 :: created build repo
2026-Jul-02 07:38:40 :: [riscv64] #100 libabseil-cpp-20260526.0-alt1.src.rpm: build start
2026-Jul-02 07:38:43 :: [riscv64] #100 libabseil-cpp-20260526.0-alt1.src.rpm: build swiftly SKIPPED
2026-Jul-02 07:38:43 :: [riscv64] #200 ton-2026.04-alt1.src.rpm: build start
2026-Jul-02 07:40:48 :: [riscv64] #200 ton-2026.04-alt1.src.rpm: build SKIPPED
2026-Jul-02 07:40:48 :: [riscv64] #300 libwebrtc-audio-processing-1.3-alt3.src.rpm: build start
2026-Jul-02 07:40:50 :: [riscv64] #300 libwebrtc-audio-processing-1.3-alt3.src.rpm: build swiftly SKIPPED
2026-Jul-02 07:40:50 :: [riscv64] #400 libre2-20251105-alt1.src.rpm: build start
2026-Jul-02 07:40:53 :: [riscv64] #400 libre2-20251105-alt1.src.rpm: build swiftly SKIPPED
2026-Jul-02 07:40:53 :: [riscv64] #500 clickhouse-cpp-2.6.2-alt1.src.rpm: build start
2026-Jul-02 07:40:55 :: [riscv64] #500 clickhouse-cpp-2.6.2-alt1.src.rpm: build swiftly SKIPPED
2026-Jul-02 07:40:55 :: [riscv64] #600 libwebrtc-audio-processing-2-2.1-alt2.src.rpm: build start
2026-Jul-02 07:40:58 :: [riscv64] #600 libwebrtc-audio-processing-2-2.1-alt2.src.rpm: build swiftly SKIPPED
2026-Jul-02 07:40:58 :: [riscv64] #700 protobuf-31.1-alt1.1.src.rpm: build start
[riscv64] [INFO] -------------------------------------------------------------
[riscv64] [ERROR] COMPILATION ERROR : 
[riscv64] [INFO] -------------------------------------------------------------
2026-Jul-02 08:21:27 :: [riscv64] protobuf-31.1-alt1.1.src.rpm: remote: build failed
2026-Jul-02 08:21:27 :: [riscv64] #700 protobuf-31.1-alt1.1.src.rpm: build FAILED
2026-Jul-02 08:21:27 :: [riscv64] #700 protobuf-31.1-alt1.1.src.rpm:: KEEP_GOING cheat activated, moving on
2026-Jul-02 08:21:28 :: [riscv64] #1000 python3-module-grpcio-1.80.0-alt2.src.rpm: build start
2026-Jul-02 08:42:06 :: [riscv64] #1000 python3-module-grpcio-1.80.0-alt2.src.rpm: build OK
2026-Jul-02 08:42:06 :: [riscv64] #1100 hyprland-0.54.3-alt1.src.rpm: build start
2026-Jul-02 08:55:55 :: [riscv64] #1100 hyprland-0.54.3-alt1.src.rpm: build OK
2026-Jul-02 08:55:55 :: [riscv64] #1200 grpc-1.80.0-alt1.1.src.rpm: build start
[riscv64] /usr/src/RPM/BUILD/grpc-1.80.0/src/core/call/call_state.h: In static member function 'static const char* grpc_core::CallState::ServerTrailingMetadataStateString(ServerTrailingMetadataState)':
[riscv64] /usr/src/RPM/BUILD/grpc-1.80.0/src/core/call/call_state.h:314:3: warning: control reaches end of non-void function [-Wreturn-type]
[riscv64]   314 |   }
[riscv64] /usr/src/RPM/BUILD/grpc-1.80.0/src/core/call/call_state.h: In static member function 'static const char* grpc_core::CallState::ServerToClientPushStateString(ServerToClientPushState)':
[riscv64] /usr/src/RPM/BUILD/grpc-1.80.0/src/core/call/call_state.h:284:3: warning: control reaches end of non-void function [-Wreturn-type]
[riscv64]   284 |   }
[riscv64] ninja: build stopped: subcommand failed.
[riscv64] error: Bad exit status from /usr/src/tmp/rpmb-tmp.kglrU4 (%build)
[riscv64] RPM build errors:
[riscv64]     Bad exit status from /usr/src/tmp/rpmb-tmp.kglrU4 (%build)
2026-Jul-02 09:11:27 :: [riscv64] grpc-1.80.0-alt1.1.src.rpm: remote: build failed
2026-Jul-02 09:11:27 :: [riscv64] #1200 grpc-1.80.0-alt1.1.src.rpm: build FAILED
2026-Jul-02 09:11:27 :: [riscv64] #1200 grpc-1.80.0-alt1.1.src.rpm:: KEEP_GOING cheat activated, moving on
2026-Jul-02 09:11:28 :: [riscv64] #1300 protobuf-c-1.5.2-alt1.src.rpm: build start
[riscv64] ld: protobuf-c/protoc_gen_c_protoc_gen_c-protobuf-c.pb.o: in function `ProtobufCMessageOptions::ByteSizeLong() const':
[riscv64] /usr/src/RPM/BUILD/protobuf-c-1.5.2/protobuf-c/protobuf-c.pb.cc:783:(.text+0x294): undefined reference to `google::protobuf::internal::AssignDescriptors(google::protobuf::internal::DescriptorTable const* (*)(), absl::lts_20260526::once_flag*, google::protobuf::Metadata const&)'
[riscv64] ld: relocation R_RISCV_CALL_PLT against `_ZN6google8protobuf8internal17AssignDescriptorsEPFPKNS1_15DescriptorTableEvEPN4absl12lts_202605269once_flagERKNS0_8MetadataE' which may bind externally can not be used when making a shared object; recompile with -fPIC
[riscv64] ld: protobuf-c/protoc_gen_c_protoc_gen_c-protobuf-c.pb.o: in function `ProtobufCFieldOptions::SharedDtor()':
[riscv64] /usr/src/RPM/BUILD/protobuf-c-1.5.2/protobuf-c/protobuf-c.pb.cc:894:(.text.unlikely+0x2e): undefined reference to `absl::lts_20260526::log_internal::LogMessageFatal::LogMessageFatal(char const*, int, char const*)'
[riscv64] ld: relocation R_RISCV_CALL_PLT against `_ZN4absl12lts_2026052612log_internal15LogMessageFatalC1EPKciS4_' which may bind externally can not be used when making a shared object; recompile with -fPIC
[riscv64] ld: protoc-gen-c/protoc_gen_c-c_helpers.o: in function `absl::lts_20260526::container_internal::raw_hash_set<absl::lts_20260526::container_internal::FlatHashMapPolicy<std::basic_string_view<char, std::char_traits<char> >, std::basic_string_view<char, std::char_traits<char> > >>::AssertNotDebugCapacity() const':
[riscv64] /usr/include/absl/container/internal/raw_hash_set.h:3588:(.text+0x11a): undefined reference to `absl::lts_20260526::raw_log_internal::RawLog(absl::lts_20260526::LogSeverity, char const*, int, char const*, ...)'
[riscv64] ld: relocation R_RISCV_CALL_PLT against `_ZN4absl12lts_2026052616raw_log_internal6RawLogENS0_11LogSeverityEPKciS4_z' which may bind externally can not be used when making a shared object; recompile with -fPIC
[riscv64] ld: protoc-gen-c/protoc_gen_c-main.o: in function `main':
[riscv64] /usr/src/RPM/BUILD/protobuf-c-1.5.2/protoc-gen-c/main.cc:53:(.text.startup+0xf4): undefined reference to `absl::lts_20260526::log_internal::LogMessage::LogMessage(char const*, int, absl::lts_20260526::log_internal::LogMessage::WarningTag)'
[riscv64] ld: relocation R_RISCV_CALL_PLT against `_ZN4absl12lts_2026052612log_internal10LogMessageC1EPKciNS2_10WarningTagE' which may bind externally can not be used when making a shared object; recompile with -fPIC
[riscv64] ld: protoc-gen-c/protoc_gen_c-c_bytes_field.o: in function `absl::lts_20260526::container_internal::raw_hash_set<absl::lts_20260526::container_internal::FlatHashMapPolicy<std::basic_string_view<char, std::char_traits<char> >, std::basic_string_view<char, std::char_traits<char> > >>::AssertNotDebugCapacity() const':
[riscv64] /usr/include/absl/container/internal/raw_hash_set.h:3588:(.text+0xf6): undefined reference to `absl::lts_20260526::raw_log_internal::RawLog(absl::lts_20260526::LogSeverity, char const*, int, char const*, ...)'
[riscv64] ld: relocation R_RISCV_CALL_PLT against `_ZN4absl12lts_2026052616raw_log_internal6RawLogENS0_11LogSeverityEPKciS4_z' which may bind externally can not be used when making a shared object; recompile with -fPIC
[riscv64] ld: protoc-gen-c/protoc_gen_c-c_bytes_field.o: in function `void google::protobuf::io::Printer::Print<std::map<std::__cxx11::basic_string<char, std::char_traits<char>, std::allocator<char> >, std::__cxx11::basic_string<char, std::char_traits<char>, std::allocator<char> >, std::less<std::__cxx11::basic_string<char, std::char_traits<char>, std::allocator<char> > >, std::allocator<std::pair<std::__cxx11::basic_string<char, std::char_traits<char>, std::allocator<char> > const, std::__cxx11::basic_string<char, std::char_traits<char>, std::allocator<char> > > > > >(std::map<std::__cxx11::basic_string<char, std::char_traits<char>, std::allocator<char> >, std::__cxx11::basic_string<char, std::char_traits<char>, std::allocator<char> >, std::less<std::__cxx11::basic_string<char, std::char_traits<char>, std::allocator<char> > >, std::allocator<std::pair<std::__cxx11::basic_string<char, std::char_traits<char>, std::allocator<char> > const, std::__cxx11::basic_string<char, std::char_tra
 its<char>, std::allocator<char> > > > > const&, std::basic_string_view<char, std::char_traits<char> >)':
[riscv64] /usr/src/RPM/BUILD/protobuf-c-1.5.2/google/protobuf/io/printer.h:1049:(.text._ZN6google8protobuf2io7Printer5PrintISt3mapINSt7__cxx1112basic_stringIcSt11char_traitsIcESaIcEEESA_St4lessISA_ESaISt4pairIKSA_SA_EEEEEvRKT_St17basic_string_viewIcS8_E[_ZN6google8protobuf2io7Printer5PrintISt3mapINSt7__cxx1112basic_stringIcSt11char_traitsIcESaIcEEESA_St4lessISA_ESaISt4pairIKSA_SA_EEEEEvRKT_St17basic_string_viewIcS8_E]+0x68): undefined reference to `google::protobuf::io::Printer::PrintImpl(std::basic_string_view<char, std::char_traits<char> >, absl::lts_20260526::Span<std::__cxx11::basic_string<char, std::char_traits<char>, std::allocator<char> > const>, google::protobuf::io::Printer::PrintOptions)'
[riscv64] ld: relocation R_RISCV_CALL_PLT against `_ZN6google8protobuf2io7Printer9PrintImplESt17basic_string_viewIcSt11char_traitsIcEEN4absl12lts_202605264SpanIKNSt7__cxx1112basic_stringIcS5_SaIcEEEEENS2_12PrintOptionsE' which may bind externally can not be used when making a shared object; recompile with -fPIC
[riscv64] ld: protoc-gen-c/protoc_gen_c-c_bytes_field.o: in function `absl::lts_20260526::container_internal::raw_hash_set<absl::lts_20260526::container_internal::FlatHashMapPolicy<std::basic_string_view<char, std::char_traits<char> >, std::basic_string_view<char, std::char_traits<char> > >>::dealloc()':
[riscv64] /usr/include/absl/container/internal/raw_hash_set.h:3302:(.text._ZN4absl12lts_2026052618container_internal12raw_hash_setINS1_17FlatHashMapPolicyISt17basic_string_viewIcSt11char_traitsIcEES7_EEJEE15destructor_implEv[_ZN4absl12lts_2026052618container_internal12raw_hash_setINS1_17FlatHashMapPolicyISt17basic_string_viewIcSt11char_traitsIcEES7_EEJEE15destructor_implEv]+0x5e): undefined reference to `void absl::lts_20260526::container_internal::DeallocateBackingArray<8ul, std::allocator<char> >(void*, unsigned long, absl::lts_20260526::container_internal::ctrl_t*, unsigned long, unsigned long, bool)'
[riscv64] ld: relocation R_RISCV_CALL_PLT against `_ZN4absl12lts_2026052618container_internal22DeallocateBackingArrayILm8ESaIcEEEvPvmPNS1_6ctrl_tEmmb' which may bind externally can not be used when making a shared object; recompile with -fPIC
[riscv64] ld: protoc-gen-c/protoc_gen_c-c_bytes_field.o: in function `void google::protobuf::io::Printer::Print<absl::lts_20260526::flat_hash_map<std::basic_string_view<char, std::char_traits<char> >, std::basic_string_view<char, std::char_traits<char> >, absl::lts_20260526::container_internal::StringHash, absl::lts_20260526::container_internal::StringEq, std::allocator<std::pair<std::basic_string_view<char, std::char_traits<char> > const, std::basic_string_view<char, std::char_traits<char> > > > > >(absl::lts_20260526::flat_hash_map<std::basic_string_view<char, std::char_traits<char> >, std::basic_string_view<char, std::char_traits<char> >, absl::lts_20260526::container_internal::StringHash, absl::lts_20260526::container_internal::StringEq, std::allocator<std::pair<std::basic_string_view<char, std::char_traits<char> > const, std::basic_string_view<char, std::char_traits<char> > > > > const&, std::basic_string_view<char, std::char_traits<char> >)':
[riscv64] /usr/src/RPM/BUILD/protobuf-c-1.5.2/google/protobuf/io/printer.h:1049:(.text._ZN6google8protobuf2io7Printer5PrintIN4absl12lts_2026052613flat_hash_mapISt17basic_string_viewIcSt11char_traitsIcEESA_NS5_18container_internal10StringHashENSB_8StringEqESaISt4pairIKSA_SA_EEEEEEvRKT_SA_[_ZN6google8protobuf2io7Printer5PrintIN4absl12lts_2026052613flat_hash_mapISt17basic_string_viewIcSt11char_traitsIcEESA_NS5_18container_internal10StringHashENSB_8StringEqESaISt4pairIKSA_SA_EEEEEEvRKT_SA_]+0x68): undefined reference to `google::protobuf::io::Printer::PrintImpl(std::basic_string_view<char, std::char_traits<char> >, absl::lts_20260526::Span<std::__cxx11::basic_string<char, std::char_traits<char>, std::allocator<char> > const>, google::protobuf::io::Printer::PrintOptions)'
[riscv64] ld: relocation R_RISCV_CALL_PLT against `_ZN6google8protobuf2io7Printer9PrintImplESt17basic_string_viewIcSt11char_traitsIcEEN4absl12lts_202605264SpanIKNSt7__cxx1112basic_stringIcS5_SaIcEEEEENS2_12PrintOptionsE' which may bind externally can not be used when making a shared object; recompile with -fPIC
[riscv64] ld: protoc-gen-c/protoc_gen_c-c_bytes_field.o: in function `absl::lts_20260526::container_internal::raw_hash_set<absl::lts_20260526::container_internal::FlatHashMapPolicy<std::basic_string_view<char, std::char_traits<char> >, std::basic_string_view<char, std::char_traits<char> > >>::dealloc()':
[riscv64] /usr/include/absl/container/internal/raw_hash_set.h:3302:(.text._ZN6google8protobuf2io7Printer5PrintIJEEEvSt17basic_string_viewIcSt11char_traitsIcEEDpRKT_[_ZN6google8protobuf2io7Printer5PrintIJEEEvSt17basic_string_viewIcSt11char_traitsIcEEDpRKT_]+0x7a): undefined reference to `void absl::lts_20260526::container_internal::DeallocateBackingArray<8ul, std::allocator<char> >(void*, unsigned long, absl::lts_20260526::container_internal::ctrl_t*, unsigned long, unsigned long, bool)'
[riscv64] ld: relocation R_RISCV_CALL_PLT against `_ZN4absl12lts_2026052618container_internal22DeallocateBackingArrayILm8ESaIcEEEvPvmPNS1_6ctrl_tEmmb' which may bind externally can not be used when making a shared object; recompile with -fPIC
[riscv64] ld: protoc-gen-c/protoc_gen_c-c_bytes_field.o: in function `decltype (DecomposePairImpl((forward<absl::lts_20260526::container_internal::EqualElement<std::basic_string_view<char, std::char_traits<char> >, absl::lts_20260526::container_internal::StringEq> >)({parm#1}), PairArgs((forward<std::pair<std::basic_string_view<char, std::char_traits<char> > const, std::basic_string_view<char, std::char_traits<char> > >&>)({parm#2})))) absl::lts_20260526::container_internal::DecomposePair<absl::lts_20260526::container_internal::EqualElement<std::basic_string_view<char, std::char_traits<char> >, absl::lts_20260526::container_internal::StringEq>, std::pair<std::basic_string_view<char, std::char_traits<char> > const, std::basic_string_view<char, std::char_traits<char> > >&>(absl::lts_20260526::container_internal::EqualElement<std::basic_string_view<char, std::char_traits<char> >, absl::lts_20260526::container_internal::StringEq>&&, std::pair<std::basic_string_view<char, std::char_traits
 <char> > const, std::basic_string_view<char, std::char_traits<char> > >&)':
[riscv64] /usr/include/absl/container/internal/container_memory.h:227:(.text._ZNSt17_Function_handlerIFSt8optionalIN6google8protobuf2io7Printer9ValueImplILb0EEEESt17basic_string_viewIcSt11char_traitsIcEEEZNS4_8WithVarsIN4absl12lts_2026052613flat_hash_mapISB_SB_NSF_18container_internal10StringHashENSH_8StringEqESaISt4pairIKSB_SB_EEEEEEDaPKT_EUlSB_E_E9_M_invokeERKSt9_Any_dataOSB_[_ZNSt17_Function_handlerIFSt8optionalIN6google8protobuf2io7Printer9ValueImplILb0EEEESt17basic_string_viewIcSt11char_traitsIcEEEZNS4_8WithVarsIN4absl12lts_2026052613flat_hash_mapISB_SB_NSF_18container_internal10StringHashENSH_8StringEqESaISt4pairIKSB_SB_EEEEEEDaPKT_EUlSB_E_E9_M_invokeERKSt9_Any_dataOSB_]+0x226): undefined reference to `absl::lts_20260526::container_internal::kSooControl'
[riscv64] ld: protoc-gen-c/protoc_gen_c-c_bytes_field.o: in function `absl::lts_20260526::container_internal::HashtableInlineDataImpl<(absl::lts_20260526::container_internal::HashtableCapacityStorageMode)1>::capacity() const':
2026-Jul-02 09:15:45 :: [riscv64] protobuf-c-1.5.2-alt1.src.rpm: remote: build failed
2026-Jul-02 09:15:45 :: [riscv64] #1300 protobuf-c-1.5.2-alt1.src.rpm: build FAILED
2026-Jul-02 09:15:45 :: [riscv64] #1300 protobuf-c-1.5.2-alt1.src.rpm:: KEEP_GOING cheat activated, moving on
2026-Jul-02 09:15:46 :: [riscv64] #1400 onnx-1.21.0-alt1.src.rpm: build start
[riscv64] verify-elf: WARNING: ./usr/lib64/libonnx.so.1.21.0: skipping eu-elflint by request
[riscv64] verify-elf: ERROR: ./usr/lib64/libonnx.so.1.21.0: undefined symbol: _ZN6google8protobuf8internal17AssignDescriptorsEPFPKNS1_15DescriptorTableEvEPN4absl12lts_202605269once_flagERKNS0_8MetadataE
[riscv64] verify-elf: WARNING: ./usr/lib64/libonnx_proto.so.1.21.0: skipping eu-elflint by request
[riscv64] verify-elf: ERROR: ./usr/lib64/libonnx_proto.so.1.21.0: undefined symbol: _ZN6google8protobuf8internal17AssignDescriptorsEPFPKNS1_15DescriptorTableEvEPN4absl12lts_202605269once_flagERKNS0_8MetadataE
[riscv64] verify-elf: WARNING: ./usr/lib64/python3/site-packages/onnx/onnx_cpp2py_export.abi3.so: skipping eu-elflint by request
2026-Jul-02 09:29:19 :: [riscv64] onnx-1.21.0-alt1.src.rpm: remote: build failed
2026-Jul-02 09:29:19 :: [riscv64] #1400 onnx-1.21.0-alt1.src.rpm: build FAILED
2026-Jul-02 09:29:19 :: [riscv64] #1400 onnx-1.21.0-alt1.src.rpm:: KEEP_GOING cheat activated, moving on
2026-Jul-02 09:29:19 :: [riscv64] #1500 gz-msgs-12.0.0-alt1.src.rpm: build start
[riscv64] <13>Jul  2 09:30:49 rpmi: libnettle8-3.10.1-alt1 sisyphus_riscv64+71375.100.1.1 1738106891 installed
[riscv64] <13>Jul  2 09:30:49 rpmi: libgdbm6-1.26-alt1 sisyphus_riscv64+126243.100.1.1 1779345791 installed
[riscv64] <13>Jul  2 09:30:49 rpmi: libexpat-2.7.4-alt1 sisyphus_riscv64+109313.100.1.1 1770323898 installed
[riscv64] <13>Jul  2 09:30:49 rpmi: libunistring2-0.9.10-alt2 sisyphus_riscv64+130169.300.1.1 1782526409 installed
[riscv64] <13>Jul  2 09:30:49 rpmi: libidn2-2.3.8-alt1 sisyphus_riscv64+93492.100.1.1 1756433243 installed
[riscv64] <13>Jul  2 09:30:49 rpmi: libp11-kit-1:0.26.2-alt2.g5e81ed3 sisyphus_riscv64+130519.100.1.1 1782598472 installed
[riscv64] <13>Jul  2 09:30:49 rpmi: libtasn1-4.21.0-alt2 sisyphus_riscv64+128673.100.1.1 1781194651 installed
[riscv64] <13>Jul  2 09:30:49 rpmi: libgdbm_compat4-1.26-alt1 sisyphus_riscv64+126243.100.1.1 1779345791 installed
[riscv64] <13>Jul  2 09:30:49 rpmi: libhogweed6-3.10.1-alt1 sisyphus_riscv64+71375.100.1.1 1738106891 installed
[riscv64] <13>Jul  2 09:30:49 rpmi: libgnutls30-3.8.13-alt1 sisyphus_riscv64+124187.100.1.1 1778517092 installed
[riscv64] <13>Jul  2 09:30:49 rpmi: libngtcp2.16-1.24.0-alt1 sisyphus_riscv64+130961.200.1.1 1782904748 installed
[riscv64] <13>Jul  2 09:30:49 rpmi: libngtcp2_crypto_gnutls8-1.24.0-alt1 sisyphus_riscv64+130961.200.1.1 1782904748 installed
[riscv64] <13>Jul  2 09:30:49 rpmi: rpm-macros-ninja-build-1:1.13.2-alt1 sisyphus_riscv64+101409.100.1.1 1763805654 installed
[riscv64] <13>Jul  2 09:30:49 rpmi: ninja-build-1:1.13.2-alt1 sisyphus_riscv64+101409.100.1.1 1763805654 installed
[riscv64] <13>Jul  2 09:30:49 rpmi: libsqlite3-3.50.4-alt1 sisyphus_riscv64+91443.100.1.1 1754555936 installed
[riscv64] <13>Jul  2 09:30:49 rpmi: libmpdec3-2.5.1-alt3 sisyphus_riscv64+29035.100.1.1 1675621702 installed
[riscv64] <13>Jul  2 09:30:49 rpmi: libb2-0.98.1-alt1_1 sisyphus_riscv64+13721.100.1.1 1638969645 installed
[riscv64] <13>Jul  2 09:30:50 rpmi: cmake-modules-4.2.6-alt1 sisyphus_riscv64+126553.100.1.1 1779488125 installed
[riscv64] <13>Jul  2 09:30:50 rpmi: libuv-1.52.1-alt2 sisyphus_riscv64+118402.100.1.1 1775741504 installed
[riscv64] <13>Jul  2 09:30:50 rpmi: librhash-1.3.5-alt3 sisyphus_riscv64+11373.100.1.1 1635835354 installed
[riscv64] <13>Jul  2 09:30:50 rpmi: libjsoncpp24-1.9.4-alt2 sisyphus_riscv64+49295.100.1.1 1716568573 installed
[riscv64] <13>Jul  2 09:30:50 rpmi: publicsuffix-list-dafsa-20260624-alt1 sisyphus_riscv64+130544.100.1.1 1782604203 installed
[riscv64] <13>Jul  2 09:30:50 rpmi: libpsl-0.22.0-alt1 sisyphus_riscv64+130560.100.1.1 1782608197 installed
[riscv64] <13>Jul  2 09:30:50 rpmi: libnghttp3.9-1.17.0-alt1 sisyphus_riscv64+130961.100.1.1 1782904379 installed
[riscv64] <13>Jul  2 09:30:50 rpmi: libnghttp2-1.69.0-alt1 sisyphus_riscv64+119674.100.1.1 1776693019 installed
[riscv64] <13>Jul  2 09:30:50 rpmi: openldap-common-2.6.13-alt1 sisyphus_riscv64+115149.100.1.1 1773831165 installed
[riscv64] <13>Jul  2 09:30:50 rpmi: libverto-0.3.2-alt1_1 sisyphus_riscv64+33133.1200.2.1 1684932150 installed
[riscv64] <13>Jul  2 09:30:50 rpmi: liblmdb-0.9.35-alt1 sisyphus_riscv64+111449.100.1.1 1771669538 installed
[riscv64] <13>Jul  2 09:30:50 rpmi: libkeyutils-1.6.3-alt1 sisyphus_riscv64+49335.100.1.1 1716592270 installed
[riscv64] <13>Jul  2 09:30:50 rpmi: libcom_err-1.47.4.0.2.a9f48-alt1 sisyphus_riscv64+121015.100.1.1 1778308586 installed
[riscv64] <13>Jul  2 09:30:50 rpmi: libbrotlicommon-1.2.0-alt1 sisyphus_riscv64+98962.100.1.1 1761678642 installed
[riscv64] <13>Jul  2 09:30:50 rpmi: libbrotlidec-1.2.0-alt1 sisyphus_riscv64+98962.100.1.1 1761678642 installed
[riscv64] <13>Jul  2 09:30:50 rpmi: openssl-config-3.5.0-alt1 sisyphus_riscv64+99925.100.1.1 1762587030 installed
[riscv64] <13>Jul  2 09:30:50 rpmi: rpm-macros-cmake-4.0.0-alt1 sisyphus_riscv64+79196.100.1.1 1744049311 installed
[riscv64] <13>Jul  2 09:30:50 rpmi: rpm-macros-alternatives-0.5.3-alt1 sisyphus_riscv64+71244.100.1.1 1738025117 installed
[riscv64] <13>Jul  2 09:30:50 rpmi: alternatives-0.5.3-alt1 sisyphus_riscv64+71244.100.1.1 1738025117 installed
[riscv64] <13>Jul  2 09:30:50 rpmi: ca-certificates-2026.04.22-alt1 sisyphus_riscv64+124784.100.1.1 1778294417 installed
[riscv64] <13>Jul  2 09:30:50 rpmi: ca-trust-0.2.0-alt1 sisyphus_riscv64+47419.100.1.1 1712764300 installed
[riscv64] <13>Jul  2 09:30:50 rpmi: p11-kit-trust-1:0.26.2-alt2.g5e81ed3 sisyphus_riscv64+130519.100.1.1 1782598472 installed
[riscv64] <13>Jul  2 09:30:50 rpmi: libcrypto3-3.5.4-alt1 sisyphus_riscv64+99925.200.1.1 1762591620 installed
[riscv64] <13>Jul  2 09:30:50 rpmi: libssl3-3.5.4-alt1 sisyphus_riscv64+99925.200.1.1 1762591620 installed
[riscv64] <13>Jul  2 09:30:50 rpmi: python3-modules-sqlite3-3.13.14-alt1 sisyphus_riscv64+131047.100.1.1 1782959608 installed
[riscv64] <13>Jul  2 09:30:51 rpmi: python3-3.13.14-alt1 sisyphus_riscv64+131047.100.1.1 1782959608 installed
[riscv64] <13>Jul  2 09:30:52 rpmi: python3-base-3.13.14-alt1 sisyphus_riscv64+131047.100.1.1 1782959608 installed
[riscv64] <86>Jul  2 09:30:52 groupadd[3790094]: group added to /etc/group: name=_keytab, GID=999
[riscv64] <86>Jul  2 09:30:52 groupadd[3790094]: group added to /etc/gshadow: name=_keytab
[riscv64] <86>Jul  2 09:30:52 groupadd[3790094]: new group: name=_keytab, GID=999
[riscv64] <13>Jul  2 09:30:52 rpmi: libkrb5-1.22.2-alt1 sisyphus_riscv64+109182.100.1.1 1770257536 installed
[riscv64] <86>Jul  2 09:30:52 groupadd[3790102]: group added to /etc/group: name=sasl, GID=998
[riscv64] <86>Jul  2 09:30:52 groupadd[3790102]: group added to /etc/gshadow: name=sasl
[riscv64] <86>Jul  2 09:30:52 groupadd[3790102]: new group: name=sasl, GID=998
[riscv64] <13>Jul  2 09:30:52 rpmi: libsasl2-3-2.1.28-alt5 sisyphus_riscv64+127683.100.1.1 1780477783 installed
[riscv64] <13>Jul  2 09:30:52 rpmi: libldap2-2.6.13-alt1 sisyphus_riscv64+115149.100.1.1 1773831165 installed
[riscv64] <13>Jul  2 09:30:52 rpmi: python3-module-py3dephell-0.3.1-alt1 sisyphus_riscv64+67758.200.1.1 1734524951 installed
[riscv64] <13>Jul  2 09:30:52 rpmi: tests-for-installed-python3-pkgs-0.1.29-alt1 sisyphus_riscv64+100285.100.1.1 1762815565 installed
[riscv64] <13>Jul  2 09:30:53 rpmi: libarchive13-3.8.5-alt1 sisyphus_riscv64+110011.100.1.1 1770695518 installed
[riscv64] <13>Jul  2 09:30:53 rpmi: libssh2-1.11.1-alt2 sisyphus_riscv64+128440.100.1.1 1781094977 installed
[riscv64] <13>Jul  2 09:30:53 rpmi: libcurl-8.21.0-alt1 sisyphus_riscv64+130173.100.1.1 1782405411 installed
[riscv64] <13>Jul  2 09:30:54 rpmi: cmake-4.2.6-alt1 sisyphus_riscv64+126553.100.1.1 1779488125 installed
[riscv64] <13>Jul  2 09:30:54 rpmi: rpm-build-python3-0.1.29-alt1 sisyphus_riscv64+100285.100.1.1 1762815565 installed
[riscv64] <13>Jul  2 09:30:54 rpmi: rpm-build-ninja-1:1.13.2-alt1 sisyphus_riscv64+101409.100.1.1 1763805654 installed
[riscv64] Reading Package Lists...
[riscv64] Building Dependency Tree...
[riscv64] MI2a: marked for install (shallow): gcc-c++
[riscv64] MI2a:  satisfying Depends: gcc15-c++  (NULL)
[riscv64] MI2a:   maybe install (a direct target): gcc15-c++ 15.2.1-alt0.port:sisyphus_riscv64+125337.100.1.1 at 1778705208
[riscv64] MI2a:  target SELECTED: gcc15-c++ 15.2.1-alt0.port:sisyphus_riscv64+125337.100.1.1 at 1778705208
[riscv64] MI2a:  requesting to install gcc15-c++ (unspec'd ver; inspect with Debug::pkgMark-shallow)
[riscv64] MI2a:    marked for install (shallow): gcc15-c++
[riscv64] MI2a:     satisfying Depends: libstdc++15-devel = 15.2.1-alt0.port:sisyphus_riscv64+125337.100.1.1
[riscv64] MI2a:      maybe install (a direct target): libstdc++15-devel 15.2.1-alt0.port:sisyphus_riscv64+125337.100.1.1 at 1778705208
[riscv64] MI2a:     target SELECTED: libstdc++15-devel 15.2.1-alt0.port:sisyphus_riscv64+125337.100.1.1 at 1778705208
[riscv64] MI2a:     requesting to install libstdc++15-devel (unspec'd ver; inspect with Debug::pkgMark-shallow)
[riscv64] MI2a:       marked for install (shallow): libstdc++15-devel
[riscv64] MI2a:        satisfying PreDepends: gcc-c++-common >= 1.4.7
[riscv64] MI2a:         maybe install (a direct target): gcc-c++-common 1.4.28-alt1:sisyphus_riscv64+49202.100.1.1 at 1716505224
[riscv64] MI2a:        target SELECTED: gcc-c++-common 1.4.28-alt1:sisyphus_riscv64+49202.100.1.1 at 1716505224
[riscv64] MI2a:        requesting to install gcc-c++-common (unspec'd ver; inspect with Debug::pkgMark-shallow)
[riscv64] MI2a:          marked for install (shallow): gcc-c++-common
[riscv64] MI2a: marked for install (shallow): libprotobuf-devel
[riscv64] MI2a:  satisfying Depends: libabseil-cpp-devel  (NULL)
[riscv64] MI2a:   maybe install (a direct target): libabseil-cpp-devel 20260526.0-alt1:sisyphus_riscv64+131046.100.1.1 at 1782940655
[riscv64] MI2a:  target SELECTED: libabseil-cpp-devel 20260526.0-alt1:sisyphus_riscv64+131046.100.1.1 at 1782940655
[riscv64] MI2a:  requesting to install libabseil-cpp-devel (unspec'd ver; inspect with Debug::pkgMark-shallow)
[riscv64] MI2a:    marked for install (shallow): libabseil-cpp-devel
[riscv64] MI2a:     satisfying Depends: libgmock-devel  (NULL)
[riscv64] MI2a:      maybe install (a direct target): libgmock-devel 1.17.0-alt1.1:sisyphus_riscv64+104610.100.1.1 at 1766077287
[riscv64] MI2a:     target SELECTED: libgmock-devel 1.17.0-alt1.1:sisyphus_riscv64+104610.100.1.1 at 1766077287
[riscv64] MI2a:     requesting to install libgmock-devel (unspec'd ver; inspect with Debug::pkgMark-shallow)
[riscv64] MI2a:       marked for install (shallow): libgmock-devel
[riscv64] MI2a:        satisfying Depends: libgtest-devel = 1.17.0-alt1.1:sisyphus_riscv64+104610.100.1.1
[riscv64] MI2a:         maybe install (a direct target): libgtest-devel 1.17.0-alt1.1:sisyphus_riscv64+104610.100.1.1 at 1766077287
[riscv64] MI2a:        target SELECTED: libgtest-devel 1.17.0-alt1.1:sisyphus_riscv64+104610.100.1.1 at 1766077287
[riscv64] MI2a:        requesting to install libgtest-devel (unspec'd ver; inspect with Debug::pkgMark-shallow)
[riscv64] MI2a:          marked for install (shallow): libgtest-devel
[riscv64] MI2a:        satisfying Depends: libgmock = 1.17.0-alt1.1:sisyphus_riscv64+104610.100.1.1
[riscv64] MI2a:         maybe install (a direct target): libgmock 1.17.0-alt1.1:sisyphus_riscv64+104610.100.1.1 at 1766077287
[riscv64] MI2a:        target SELECTED: libgmock 1.17.0-alt1.1:sisyphus_riscv64+104610.100.1.1 at 1766077287
[riscv64] MI2a:        requesting to install libgmock (unspec'd ver; inspect with Debug::pkgMark-shallow)
[riscv64] MI2a:          marked for install (shallow): libgmock
[riscv64] MI2a:           satisfying Depends: libgtest = 1.17.0-alt1.1:sisyphus_riscv64+104610.100.1.1
[riscv64] MI2a:            maybe install (a direct target): libgtest 1.17.0-alt1.1:sisyphus_riscv64+104610.100.1.1 at 1766077287
[riscv64] MI2a:           target SELECTED: libgtest 1.17.0-alt1.1:sisyphus_riscv64+104610.100.1.1 at 1766077287
[riscv64] MI2a:           requesting to install libgtest (unspec'd ver; inspect with Debug::pkgMark-shallow)
[riscv64] MI2a:             marked for install (shallow): libgtest
[riscv64] MI2a:     satisfying Depends: libabseil-cpp-testing = 20260526.0-alt1:sisyphus_riscv64+131046.100.1.1
[riscv64] MI2a:      maybe install (a direct target): libabseil-cpp-testing 20260526.0-alt1:sisyphus_riscv64+131046.100.1.1 at 1782940655
[riscv64] MI2a:     target SELECTED: libabseil-cpp-testing 20260526.0-alt1:sisyphus_riscv64+131046.100.1.1 at 1782940655
[riscv64] MI2a:     requesting to install libabseil-cpp-testing (unspec'd ver; inspect with Debug::pkgMark-shallow)
[riscv64] MI2a:       marked for install (shallow): libabseil-cpp-testing
[riscv64] MI2a:        satisfying Depends: libabseil-cpp2605.0.0 = 20260526.0-alt1:sisyphus_riscv64+131046.100.1.1
[riscv64] MI2a:         maybe install (a direct target): libabseil-cpp2605.0.0 20260526.0-alt1:sisyphus_riscv64+131046.100.1.1 at 1782940655
[riscv64] MI2a:        target SELECTED: libabseil-cpp2605.0.0 20260526.0-alt1:sisyphus_riscv64+131046.100.1.1 at 1782940655
[riscv64] MI2a:        requesting to install libabseil-cpp2605.0.0 (unspec'd ver; inspect with Debug::pkgMark-shallow)
[riscv64] MI2a:          marked for install (shallow): libabseil-cpp2605.0.0
[riscv64] MI2a:  satisfying Depends: zlib-devel  (NULL)
[riscv64] MI2a:   maybe install (a direct target): zlib-devel 1.3.1-alt1:sisyphus_riscv64+45939.100.1.1 at 1710445788
[riscv64] MI2a:  target SELECTED: zlib-devel 1.3.1-alt1:sisyphus_riscv64+45939.100.1.1 at 1710445788
[riscv64] MI2a:  requesting to install zlib-devel (unspec'd ver; inspect with Debug::pkgMark-shallow)
[riscv64] MI2a:    marked for install (shallow): zlib-devel
[riscv64] MI2a:  satisfying Depends: protobuf-compiler = 3.25.5-alt7:sisyphus_riscv64+110252.100.1.1
[riscv64] MI2a:   maybe install (a direct target): protobuf-compiler 3.25.5-alt7:sisyphus_riscv64+110252.100.1.1 at 1770824841
[riscv64] MI2a:  target SELECTED: protobuf-compiler 3.25.5-alt7:sisyphus_riscv64+110252.100.1.1 at 1770824841
[riscv64] MI2a:  requesting to install protobuf-compiler (unspec'd ver; inspect with Debug::pkgMark-shallow)
[riscv64] MI2a:    marked for install (shallow): protobuf-compiler
[riscv64] MI2a:     satisfying Depends: libabsl_log_initialize.so.2501.0.0()(64bit) >= set:dcee
[riscv64] MI2a:      maybe install (a providing target): libabseil-cpp2501.0.0 20250127.1-alt2:sisyphus_riscv64+88492.100.1.1 at 1751624519
[riscv64] MI2a:     target SELECTED: libabseil-cpp2501.0.0 20250127.1-alt2:sisyphus_riscv64+88492.100.1.1 at 1751624519
[riscv64] MI2a:     requesting to install libabseil-cpp2501.0.0 (unspec'd ver; inspect with Debug::pkgMark-shallow)
[riscv64] MI2a:       marked for install (shallow): libabseil-cpp2501.0.0
[riscv64] MI2a:     satisfying Depends: libprotobuf25 = 3.25.5-alt7:sisyphus_riscv64+110252.100.1.1
[riscv64] MI2a:      maybe install (a direct target): libprotobuf25 3.25.5-alt7:sisyphus_riscv64+110252.100.1.1 at 1770824841
[riscv64] MI2a:     target SELECTED: libprotobuf25 3.25.5-alt7:sisyphus_riscv64+110252.100.1.1 at 1770824841
[riscv64] MI2a:     requesting to install libprotobuf25 (unspec'd ver; inspect with Debug::pkgMark-shallow)
[riscv64] MI2a:       marked for install (shallow): libprotobuf25
[riscv64] MI2a:  satisfying Depends: libprotobuf-lite-devel = 3.25.5-alt7:sisyphus_riscv64+110252.100.1.1
[riscv64] MI2a:   maybe install (a direct target): libprotobuf-lite-devel 3.25.5-alt7:sisyphus_riscv64+110252.100.1.1 at 1770824841
[riscv64] MI2a:  target SELECTED: libprotobuf-lite-devel 3.25.5-alt7:sisyphus_riscv64+110252.100.1.1 at 1770824841
[riscv64] MI2a:  requesting to install libprotobuf-lite-devel (unspec'd ver; inspect with Debug::pkgMark-shallow)
[riscv64] MI2a:    marked for install (shallow): libprotobuf-lite-devel
[riscv64] MI2a:     satisfying Depends: libprotobuf25-lite = 3.25.5-alt7:sisyphus_riscv64+110252.100.1.1
[riscv64] MI2a:      maybe install (a direct target): libprotobuf25-lite 3.25.5-alt7:sisyphus_riscv64+110252.100.1.1 at 1770824841
[riscv64] MI2a:     target SELECTED: libprotobuf25-lite 3.25.5-alt7:sisyphus_riscv64+110252.100.1.1 at 1770824841
[riscv64] MI2a:     requesting to install libprotobuf25-lite (unspec'd ver; inspect with Debug::pkgMark-shallow)
[riscv64] MI2a:       marked for install (shallow): libprotobuf25-lite
[riscv64] MI2a: marked for install (shallow): libtinyxml2-devel
[riscv64] MI2a:  satisfying Depends: libtinyxml2.11 = 11.0.0-alt1:sisyphus_riscv64+77716.100.1.1
[riscv64] MI2a:   maybe install (a direct target): libtinyxml2.11 11.0.0-alt1:sisyphus_riscv64+77716.100.1.1 at 1743102729
[riscv64] MI2a:  target SELECTED: libtinyxml2.11 11.0.0-alt1:sisyphus_riscv64+77716.100.1.1 at 1743102729
[riscv64] MI2a:  requesting to install libtinyxml2.11 (unspec'd ver; inspect with Debug::pkgMark-shallow)
[riscv64] MI2a:    marked for install (shallow): libtinyxml2.11
[riscv64] cmake is already the newest version.
[riscv64] rpm-build-ninja is already the newest version.
[riscv64] rpm-build-python3 is already the newest version.
[riscv64] E: Couldn't find package libgz-math-devel
[riscv64] hsh-install: Failed to calculate package file list.
[riscv64] hsh-install: Failed to generate package file list.
2026-Jul-02 09:30:59 :: [riscv64] gz-msgs-12.0.0-alt1.src.rpm: remote: cannot build src.rpm
2026-Jul-02 09:30:59 :: [riscv64] #1500 gz-msgs-12.0.0-alt1.src.rpm: build FAILED
2026-Jul-02 09:30:59 :: [riscv64] #1500 gz-msgs-12.0.0-alt1.src.rpm:: KEEP_GOING cheat activated, moving on
2026-Jul-02 09:31:00 :: [riscv64] #1600 libprotobuf-mutator-1.5-alt1.src.rpm: build start
[riscv64] ld: /usr/src/tmp/ccszgbxa.ltrans0.ltrans.o: in function `LibFuzzerTest_LLVMFuzzerTestOneInput_Test::TestBody()':
[riscv64] /usr/include/c++/15/bits/std_function.h:245:(.text+0x972a): undefined reference to `absl::lts_20260526::log_internal::LogMessageFatal::LogMessageFatal(char const*, int, char const*)'
[riscv64] ld: /usr/src/tmp/ccszgbxa.ltrans0.ltrans.o: in function `LibFuzzerTest_LLVMFuzzerTestOneInput_Test::TestBody()':
[riscv64] /usr/include/gtest/gtest-matchers.h:328:(.text+0x973e): undefined reference to `void absl::lts_20260526::log_internal::LogMessage::CopyToEncodedBuffer<(absl::lts_20260526::log_internal::LogMessage::StringType)0>(std::basic_string_view<char, std::char_traits<char> >)'
[riscv64] ld: /usr/include/gtest/gtest-matchers.h:391:(.text+0x9752): undefined reference to `absl::lts_20260526::log_internal::LogMessage::operator<<(std::__cxx11::basic_string<char, std::char_traits<char>, std::allocator<char> > const&)'
[riscv64] ld: /usr/include/gtest/gtest-matchers.h:328:(.text+0x9766): undefined reference to `void absl::lts_20260526::log_internal::LogMessage::CopyToEncodedBuffer<(absl::lts_20260526::log_internal::LogMessage::StringType)0>(std::basic_string_view<char, std::char_traits<char> >)'
[riscv64] ld: /usr/src/tmp/ccszgbxa.ltrans0.ltrans.o: in function `LibFuzzerTest_LLVMFuzzerTestOneInput_Test::TestBody()':
[riscv64] /usr/src/RPM/BUILD/libprotobuf-mutator-1.5/src/libfuzzer/libfuzzer_test.cc:60:(.text+0x977c): undefined reference to `absl::lts_20260526::log_internal::LogMessage::operator<<(std::__cxx11::basic_string<char, std::char_traits<char>, std::allocator<char> > const&)'
[riscv64] ld: /usr/src/RPM/BUILD/libprotobuf-mutator-1.5/src/libfuzzer/libfuzzer_test.cc:60:(.text+0x9780): undefined reference to `absl::lts_20260526::log_internal::LogMessage::Flush()'
[riscv64] ld: /usr/src/RPM/BUILD/libprotobuf-mutator-1.5/src/libfuzzer/libfuzzer_test.cc:37:(.text+0x9792): undefined reference to `absl::lts_20260526::log_internal::LogMessageFatal::~LogMessageFatal()'
[riscv64] ld: ../libprotobuf-mutator.so.0: undefined reference to `absl::lts_20260526::raw_log_internal::RawLog(absl::lts_20260526::LogSeverity, char const*, int, char const*, ...)'
[riscv64] ld: ../libmutator-test-proto.so: undefined reference to `char const* absl::lts_20260526::log_internal::MakeCheckOpString<unsigned long, unsigned long>(unsigned long, unsigned long, char const*)'
[riscv64] ld: ../libmutator-test-proto.so: undefined reference to `char const* absl::lts_20260526::log_internal::MakeCheckOpString<long, long>(long, long, char const*)'
[riscv64] ld: ../libmutator-test-proto.so: undefined reference to `google::protobuf::internal::UntypedMapBase::EraseFromTree(unsigned int, absl::lts_20260526::container_internal::btree_iterator<absl::lts_20260526::container_internal::btree_node<absl::lts_20260526::container_internal::map_params_impl<google::protobuf::internal::VariantKey, google::protobuf::internal::NodeBase*, std::less<google::protobuf::internal::VariantKey>, google::protobuf::internal::MapAllocator<std::pair<google::protobuf::internal::VariantKey const, google::protobuf::internal::NodeBase*> > > >, std::pair<google::protobuf::internal::VariantKey const, google::protobuf::internal::NodeBase*>&, std::pair<google::protobuf::internal::VariantKey const, google::protobuf::internal::NodeBase*>*>)'
2026-Jul-02 09:36:13 :: [riscv64] libprotobuf-mutator-1.5-alt1.src.rpm: remote: build failed
2026-Jul-02 09:36:13 :: [riscv64] #1600 libprotobuf-mutator-1.5-alt1.src.rpm: build FAILED
2026-Jul-02 09:36:13 :: [riscv64] #1600 libprotobuf-mutator-1.5-alt1.src.rpm:: KEEP_GOING cheat activated, moving on
2026-Jul-02 09:36:14 :: [riscv64] #1700 usbguard-1.1.4-alt2.src.rpm: build start
[riscv64] libtool: link: riscv64-alt-linux-g++ -std=c++17 -pipe -frecord-gcc-switches -Wall -g -O2 -flto=auto -fvisibility=hidden -pedantic -Wno-unknown-pragmas -Wall -Wextra -Wformat=2 -Wredundant-decls -Wcast-align -Wmissing-declarations -Wmissing-include-dirs -Wmissing-format-attribute -Wswitch-enum -Wswitch-default -Winvalid-pch -Wformat-nonliteral -Wno-deprecated-register -Wno-missing-field-initializers -Wno-implicit-fallthrough -o .libs/usbguard-rule-parser src/CLI/usbguard_rule_parser-usbguard-rule-parser.o  ./.libs/libusbguard.so -pthread
[riscv64] /usr/bin/ld.bfd: ./.libs/libusbguard.so: undefined reference to `absl::lts_20260526::log_internal::LogMessage::Flush()'
[riscv64] /usr/bin/ld.bfd: ./.libs/libusbguard.so: undefined reference to `char const* absl::lts_20260526::log_internal::MakeCheckOpString<void const*, void const*>(void const*, void const*, char const*)'
[riscv64] /usr/bin/ld.bfd: ./.libs/libusbguard.so: undefined reference to `google::protobuf::internal::AssignDescriptors(google::protobuf::internal::DescriptorTable const* (*)(), absl::lts_20260526::once_flag*, google::protobuf::Metadata const&)'
[riscv64] /usr/bin/ld.bfd: ./.libs/libusbguard.so: undefined reference to `char const* absl::lts_20260526::log_internal::MakeCheckOpString<long, long>(long, long, char const*)'
[riscv64] /usr/bin/ld.bfd: ./.libs/libusbguard.so: undefined reference to `absl::lts_20260526::log_internal::LogMessageFatal::LogMessageFatal(char const*, int, char const*)'
[riscv64] /usr/bin/ld.bfd: ./.libs/libusbguard.so: undefined reference to `absl::lts_20260526::log_internal::LogMessageFatal::~LogMessageFatal()'
[riscv64] collect2: error: ld returned 1 exit status
[riscv64] make[2]: *** [Makefile:1529: usbguard-rule-parser] Error 1
[riscv64] --
[riscv64] libtool: link: riscv64-alt-linux-g++ -std=c++17 -pipe -frecord-gcc-switches -Wall -g -O2 -flto=auto -fvisibility=hidden -pedantic -Wno-unknown-pragmas -Wall -Wextra -Wformat=2 -Wredundant-decls -Wcast-align -Wmissing-declarations -Wmissing-include-dirs -Wmissing-format-attribute -Wswitch-enum -Wswitch-default -Winvalid-pch -Wformat-nonliteral -Wno-deprecated-register -Wno-missing-field-initializers -Wno-implicit-fallthrough -o .libs/usbguard-dbus src/DBus/usbguard_dbus-gdbus-server.o src/DBus/usbguard_dbus-DBusBridge.o  ./.libs/libusbguard.so -ldbus-1 -lpolkit-gobject-1 -lgio-2.0 -lgobject-2.0 -lglib-2.0 -pthread
[riscv64] /usr/bin/ld.bfd: ./.libs/libusbguard.so: undefined reference to `absl::lts_20260526::log_internal::LogMessage::Flush()'
[riscv64] /usr/bin/ld.bfd: ./.libs/libusbguard.so: undefined reference to `char const* absl::lts_20260526::log_internal::MakeCheckOpString<void const*, void const*>(void const*, void const*, char const*)'
[riscv64] /usr/bin/ld.bfd: ./.libs/libusbguard.so: undefined reference to `google::protobuf::internal::AssignDescriptors(google::protobuf::internal::DescriptorTable const* (*)(), absl::lts_20260526::once_flag*, google::protobuf::Metadata const&)'
[riscv64] /usr/bin/ld.bfd: ./.libs/libusbguard.so: undefined reference to `char const* absl::lts_20260526::log_internal::MakeCheckOpString<long, long>(long, long, char const*)'
2026-Jul-02 09:43:17 :: [riscv64] usbguard-1.1.4-alt2.src.rpm: remote: build failed
2026-Jul-02 09:43:17 :: [riscv64] #1700 usbguard-1.1.4-alt2.src.rpm: build FAILED
2026-Jul-02 09:43:17 :: [riscv64] #1700 usbguard-1.1.4-alt2.src.rpm:: KEEP_GOING cheat activated, moving on
2026-Jul-02 09:43:18 :: [riscv64] #2000 mosh-1.4.0-alt1.2.src.rpm: build start
[riscv64] ld: /usr/src/tmp/ccPti8BL.ltrans0.ltrans.o: in function `serve(int, Terminal::Complete&, Network::Transport<Terminal::Complete, Network::UserStream>&, long, long)':
[riscv64] /usr/include/google/protobuf/extension_set.h:1362:(.text+0x5de2): undefined reference to `char const* absl::lts_20260526::log_internal::MakeCheckOpString<long, long>(long, long, char const*)'
[riscv64] ld: relocation R_RISCV_CALL_PLT against `_ZN4absl12lts_2026052612log_internal17MakeCheckOpStringIllEEPKcT_T0_S4_' which may bind externally can not be used when making a shared object; recompile with -fPIC
[riscv64] ld: /usr/src/tmp/ccPti8BL.ltrans1.ltrans.o: in function `Crypto::Session::~Session()':
[riscv64] /usr/src/RPM/BUILD/mosh-1.4.0/src/frontend/../crypto/crypto.h:79:(.text+0x439e): undefined reference to `char const* absl::lts_20260526::log_internal::MakeCheckOpString<long, long>(long, long, char const*)'
[riscv64] ld: relocation R_RISCV_CALL_PLT against `_ZN4absl12lts_2026052612log_internal17MakeCheckOpStringIllEEPKcT_T0_S4_' which may bind externally can not be used when making a shared object; recompile with -fPIC
[riscv64] ld: /usr/src/tmp/ccPti8BL.ltrans1.ltrans.o: in function `google::protobuf::internal::RepeatedPtrFieldBase::rep() [clone .part.0] [clone .lto_priv.0]':
[riscv64] /usr/include/google/protobuf/repeated_ptr_field.h:744:(.text.unlikely+0xea): undefined reference to `absl::lts_20260526::log_internal::LogMessageFatal::LogMessageFatal(char const*, int, char const*)'
[riscv64] ld: relocation R_RISCV_CALL_PLT against `_ZN4absl12lts_2026052612log_internal15LogMessageFatalC1EPKciS4_' which may bind externally can not be used when making a shared object; recompile with -fPIC
[riscv64] ld: /usr/src/tmp/ccPti8BL.ltrans3.ltrans.o: in function `ClientBuffers::Keystroke::_InternalSerialize(unsigned char*, google::protobuf::io::EpsCopyOutputStream*) const':
[riscv64] /usr/include/c++/15/bits/basic_string.h:1165:(.text+0x103e): undefined reference to `char const* absl::lts_20260526::log_internal::MakeCheckOpString<long, long>(long, long, char const*)'
[riscv64] ld: relocation R_RISCV_CALL_PLT against `_ZN4absl12lts_2026052612log_internal17MakeCheckOpStringIllEEPKcT_T0_S4_' which may bind externally can not be used when making a shared object; recompile with -fPIC
[riscv64] ld: /usr/src/tmp/ccPti8BL.ltrans3.ltrans.o: in function `ClientBuffers::ResizeMessage::SharedDtor() [clone .part.0]':
[riscv64] /usr/src/RPM/BUILD/mosh-1.4.0/src/frontend/../protobufs/userinput.pb.cc:701:(.text.unlikely+0x2e): undefined reference to `absl::lts_20260526::log_internal::LogMessageFatal::LogMessageFatal(char const*, int, char const*)'
[riscv64] ld: relocation R_RISCV_CALL_PLT against `_ZN4absl12lts_2026052612log_internal15LogMessageFatalC1EPKciS4_' which may bind externally can not be used when making a shared object; recompile with -fPIC
[riscv64] collect2: error: ld returned 1 exit status
[riscv64] make[3]: *** [Makefile:443: mosh-server] Error 1
[riscv64] --
[riscv64] ld: /usr/src/tmp/ccVsH3bb.ltrans0.ltrans.o: in function `Network::Transport<Network::UserStream, Terminal::Complete>::recv()':
[riscv64] /usr/src/RPM/BUILD/mosh-1.4.0/src/frontend/../network/network.cc:539:(.text+0x6460): undefined reference to `char const* absl::lts_20260526::log_internal::MakeCheckOpString<long, long>(long, long, char const*)'
[riscv64] ld: relocation R_RISCV_CALL_PLT against `_ZN4absl12lts_2026052612log_internal17MakeCheckOpStringIllEEPKcT_T0_S4_' which may bind externally can not be used when making a shared object; recompile with -fPIC
[riscv64] ld: /usr/src/tmp/ccVsH3bb.ltrans0.ltrans.o: in function `main':
[riscv64] /usr/include/c++/15/bits/stl_deque.h:520:(.text.startup+0x1f60): undefined reference to `char const* absl::lts_20260526::log_internal::MakeCheckOpString<long, long>(long, long, char const*)'
[riscv64] ld: relocation R_RISCV_CALL_PLT against `_ZN4absl12lts_2026052612log_internal17MakeCheckOpStringIllEEPKcT_T0_S4_' which may bind externally can not be used when making a shared object; recompile with -fPIC
[riscv64] ld: /usr/src/tmp/ccVsH3bb.ltrans1.ltrans.o: in function `std::vector<Network::Fragment, std::allocator<Network::Fragment> >::_M_default_append(unsigned long)':
[riscv64] /usr/include/c++/15/bits/vector.tcc:900:(.text+0x558c): undefined reference to `char const* absl::lts_20260526::log_internal::MakeCheckOpString<long, long>(long, long, char const*)'
[riscv64] ld: relocation R_RISCV_CALL_PLT against `_ZN4absl12lts_2026052612log_internal17MakeCheckOpStringIllEEPKcT_T0_S4_' which may bind externally can not be used when making a shared object; recompile with -fPIC
[riscv64] ld: /usr/src/tmp/ccVsH3bb.ltrans1.ltrans.o: in function `google::protobuf::internal::RepeatedPtrFieldBase::rep() [clone .part.0] [clone .lto_priv.0]':
[riscv64] /usr/include/google/protobuf/repeated_ptr_field.h:744:(.text.unlikely+0xce): undefined reference to `absl::lts_20260526::log_internal::LogMessageFatal::LogMessageFatal(char const*, int, char const*)'
[riscv64] ld: relocation R_RISCV_CALL_PLT against `_ZN4absl12lts_2026052612log_internal15LogMessageFatalC1EPKciS4_' which may bind externally can not be used when making a shared object; recompile with -fPIC
2026-Jul-02 09:48:20 :: [riscv64] mosh-1.4.0-alt1.2.src.rpm: remote: build failed
2026-Jul-02 09:48:20 :: [riscv64] #2000 mosh-1.4.0-alt1.2.src.rpm: build FAILED
2026-Jul-02 09:48:20 :: [riscv64] #2000 mosh-1.4.0-alt1.2.src.rpm:: KEEP_GOING cheat activated, moving on
2026-Jul-02 09:48:21 :: [riscv64] #2100 osmpbf-1.5.0-alt1_12jpp11.src.rpm: build start
[riscv64] /usr/bin/ld.bfd: /usr/src/tmp/ccqzZNRJ.ltrans0.ltrans.o: in function `void google::protobuf::internal::RepeatedPtrFieldBase::ClearNonEmpty<google::protobuf::RepeatedPtrField<std::__cxx11::basic_string<char, std::char_traits<char>, std::allocator<char> > >::TypeHandler>()':
[riscv64] /usr/include/google/protobuf/repeated_ptr_field.h:780:(.text+0x2f2): undefined reference to `char const* absl::lts_20260526::log_internal::MakeCheckOpString<long, long>(long, long, char const*)'
[riscv64] /usr/bin/ld.bfd: relocation R_RISCV_CALL_PLT against `_ZN4absl12lts_2026052612log_internal17MakeCheckOpStringIllEEPKcT_T0_S4_' which may bind externally can not be used when making a shared object; recompile with -fPIC
[riscv64] /usr/bin/ld.bfd: /usr/src/tmp/ccqzZNRJ.ltrans0.ltrans.o: in function `google::protobuf::internal::RepeatedPtrFieldBase::rep() [clone .part.0]':
[riscv64] /usr/include/google/protobuf/repeated_ptr_field.h:744:(.text.unlikely+0x2e): undefined reference to `absl::lts_20260526::log_internal::LogMessageFatal::LogMessageFatal(char const*, int, char const*)'
[riscv64] /usr/bin/ld.bfd: relocation R_RISCV_CALL_PLT against `_ZN4absl12lts_2026052612log_internal15LogMessageFatalC1EPKciS4_' which may bind externally can not be used when making a shared object; recompile with -fPIC
[riscv64] /usr/bin/ld.bfd: /usr/src/tmp/ccqzZNRJ.ltrans0.ltrans.o: in function `main':
[riscv64] /usr/src/RPM/BUILD/OSM-binary-1.5.0/tools/osmpbf-outline.cpp:306:(.text.startup+0x568): undefined reference to `char const* absl::lts_20260526::log_internal::MakeCheckOpString<long, long>(long, long, char const*)'
[riscv64] /usr/bin/ld.bfd: relocation R_RISCV_CALL_PLT against `_ZN4absl12lts_2026052612log_internal17MakeCheckOpStringIllEEPKcT_T0_S4_' which may bind externally can not be used when making a shared object; recompile with -fPIC
[riscv64] /usr/bin/ld.bfd: /usr/src/tmp/ccqzZNRJ.ltrans1.ltrans.o: in function `google::protobuf::RepeatedField<long>::GrowNoAnnotate(int, int)':
[riscv64] /usr/include/google/protobuf/repeated_field.h:333:(.text+0x4fe): undefined reference to `char const* absl::lts_20260526::log_internal::MakeCheckOpString<long, long>(long, long, char const*)'
[riscv64] /usr/bin/ld.bfd: relocation R_RISCV_CALL_PLT against `_ZN4absl12lts_2026052612log_internal17MakeCheckOpStringIllEEPKcT_T0_S4_' which may bind externally can not be used when making a shared object; recompile with -fPIC
[riscv64] /usr/bin/ld.bfd: /usr/src/tmp/ccqzZNRJ.ltrans1.ltrans.o: in function `OSMPBF::Info::SharedDtor() [clone .part.0] [clone .lto_priv.0]':
[riscv64] /usr/src/RPM/BUILD/OSM-binary-1.5.0/riscv64-alt-linux/osmpbf/osmformat.pb.cc:2342:(.text.unlikely+0x30): undefined reference to `absl::lts_20260526::log_internal::LogMessageFatal::LogMessageFatal(char const*, int, char const*)'
[riscv64] /usr/bin/ld.bfd: relocation R_RISCV_CALL_PLT against `_ZN4absl12lts_2026052612log_internal15LogMessageFatalC1EPKciS4_' which may bind externally can not be used when making a shared object; recompile with -fPIC
[riscv64] collect2: error: ld returned 1 exit status
[riscv64] /usr/bin/c++ -pipe -frecord-gcc-switches -Wall -g -O2 -flto=auto -Wl,-z,relro -Wl,--dependency-file=CMakeFiles/osmpbf-outline.dir/link.d "CMakeFiles/osmpbf-outline.dir/osmpbf-outline.cpp.o" -o osmpbf-outline  ../osmpbf/libosmpbf.a /usr/lib64/libz.so /usr/lib64/libprotobuf.so
2026-Jul-02 09:51:54 :: [riscv64] osmpbf-1.5.0-alt1_12jpp11.src.rpm: remote: build failed
2026-Jul-02 09:51:54 :: [riscv64] #2100 osmpbf-1.5.0-alt1_12jpp11.src.rpm: build FAILED
2026-Jul-02 09:51:54 :: [riscv64] #2100 osmpbf-1.5.0-alt1_12jpp11.src.rpm:: KEEP_GOING cheat activated, moving on
2026-Jul-02 09:51:55 :: [riscv64] #2200 purple-whatsapp-0.9.0-alt1.5.src.rpm: build start
2026-Jul-02 10:03:05 :: [riscv64] #2200 purple-whatsapp-0.9.0-alt1.5.src.rpm: build OK
2026-Jul-02 10:03:05 :: [riscv64] #2300 vlc-3.0.23-alt3.src.rpm: build start
2026-Jul-02 10:16:53 :: task abort requested by iv.
[riscv64]   179 |     uint8_t iod[4096];
[riscv64] libtool: link: ( cd ".libs" && rm -f "libts_plugin.la" && ln -s "../libts_plugin.la" "libts_plugin.la" )
[riscv64] make[4]: Leaving directory '/usr/src/RPM/BUILD/vlc-3.0.23/modules'
[riscv64] make[3]: *** [Makefile:28440: all-recursive] Error 1
[riscv64] make[2]: *** [Makefile:12977: all] Error 2
[riscv64] make[1]: *** [Makefile:1566: all-recursive] Error 1
[riscv64] make: *** [Makefile:1453: all] Error 2
[riscv64] error: Bad exit status from /usr/src/tmp/rpmb-tmp.LfZ8rA (%build)
[riscv64] RPM build errors:
[riscv64]     Bad exit status from /usr/src/tmp/rpmb-tmp.LfZ8rA (%build)
2026-Jul-02 11:28:35 :: [riscv64] vlc-3.0.23-alt3.src.rpm: remote: build failed
2026-Jul-02 11:28:35 :: [riscv64] #2300 vlc-3.0.23-alt3.src.rpm: build FAILED
2026-Jul-02 11:28:35 :: [riscv64] #2300 vlc-3.0.23-alt3.src.rpm:: KEEP_GOING cheat activated, moving on
2026-Jul-02 11:28:36 :: [riscv64] task processing CANCELLED
2026-Jul-02 11:28:36 :: [riscv64] build FAILED
2026-Jul-02 11:28:36 :: task #131046 for sisyphus_riscv64 FAILED


More information about the Riscv-reports mailing list