[riscv-reports] [#131066] sisyphus_riscv64 FAILED srpm=palemoon-34.3.0.1-alt1.src.rpm srpm=palemoon-el-34.3.0-alt1.src.rpm ...
Girar sisyphus_riscv64 awaiter recycler
noreply at basealt.ru
Thu Jul 2 03:12:50 MSK 2026
http://web.build.srt.basealt.ru/tasks/131066/logs/events.1.1.log
subtask name riscv64
#100 palemoon failed
2026-Jul-02 00:06:18 :: shared task #131066 for sisyphus_riscv64 started by recycler:
2026-Jul-02 00:06:18 :: message: sync
#100 build palemoon-34.3.0.1-alt1.src.rpm
#200 build palemoon-el-34.3.0-alt1.src.rpm
#300 build palemoon-uk-34.3.0-alt1.src.rpm
#400 build palemoon-pt_br-34.3.0-alt1.src.rpm
#500 build palemoon-ru-34.3.0-alt1.src.rpm
2026-Jul-02 00:06:18 :: created build repo
2026-Jul-02 00:06:23 :: [riscv64] #100 palemoon-34.3.0.1-alt1.src.rpm: build start
[riscv64] output=stdout, stderr=stderr)
[riscv64] subprocess.CalledProcessError: Command '['/usr/bin/sh', '/usr/src/RPM/BUILD/palemoon-34.3.0.1/platform/build/moz.configure/../autoconf/config.guess']' returned non-zero exit status 1.
[riscv64] *** Fix above errors and then restart with\
2026-Jul-02 00:12:49 :: [riscv64] palemoon-34.3.0.1-alt1.src.rpm: remote: build failed
2026-Jul-02 00:12:49 :: [riscv64] #100 palemoon-34.3.0.1-alt1.src.rpm: build FAILED
2026-Jul-02 00:12:49 :: [riscv64] requesting cancellation of task processing
2026-Jul-02 00:12:49 :: [riscv64] build FAILED
2026-Jul-02 00:12:49 :: task #131066 for sisyphus_riscv64 FAILED
More information about the Riscv-reports
mailing list