[riscv-reports] [#131025] sisyphus_riscv64 FAILED srpm=gwyddion3-3.11-alt1.src.rpm
Girar sisyphus_riscv64 awaiter recycler
noreply at basealt.ru
Wed Jul 1 22:22:32 MSK 2026
http://web.build.srt.basealt.ru/tasks/131025/logs/events.1.1.log
subtask name riscv64
#100 gwyddion3 failed
2026-Jul-01 19:14:22 :: shared task #131025 for sisyphus_riscv64 started by recycler:
2026-Jul-01 19:14:22 :: message: sync
#100 build gwyddion3-3.11-alt1.src.rpm
2026-Jul-01 19:14:28 :: [riscv64] #100 gwyddion3-3.11-alt1.src.rpm: build start
[riscv64] gxsm4.c: In function 'scan_aux_datasets':
[riscv64] gxsm4.c:447:14: error: too many arguments to function 'H5Oget_info_by_name1'; expected 4, have 5
[riscv64] 447 | status = H5Oget_info_by_name(loc_id, name, &infobuf, H5O_INFO_BASIC, H5P_DEFAULT);
[riscv64] --
[riscv64] nsidfile.c: In function 'detect_group_scan':
[riscv64] nsidfile.c:125:14: error: too many arguments to function 'H5Oget_info_by_name1'; expected 4, have 5
[riscv64] 125 | status = H5Oget_info_by_name(loc_id, name, &infobuf, H5O_INFO_BASIC, H5P_DEFAULT);
[riscv64] --
[riscv64] nsidfile.c: In function 'load_file':
[riscv64] nsidfile.c:208:14: error: too many arguments to function 'H5Oget_info1'; expected 2, have 3
[riscv64] 208 | status = H5Oget_info(file_id, &infobuf, H5O_INFO_BASIC);
[riscv64] --
[riscv64] 1862 | H5_DLL herr_t H5Oget_info1(hid_t loc_id, H5O_info1_t *oinfo);
[riscv64] nsidfile.c:212:43: error: 'H5O_info1_t' has no member named 'token'
[riscv64] 212 | gwyhdf5_init(&ghfile, file_id, infobuf.token);
[riscv64] --
[riscv64] hdf5file.c: In function 'ghdf5_load':
[riscv64] hdf5file.c:191:14: error: too many arguments to function 'H5Oget_info1'; expected 2, have 3
[riscv64] 191 | status = H5Oget_info(file_id, &infobuf, H5O_INFO_BASIC);
[riscv64] --
[riscv64] 1862 | H5_DLL herr_t H5Oget_info1(hid_t loc_id, H5O_info1_t *oinfo);
[riscv64] hdf5file.c:195:43: error: 'H5O_info1_t' has no member named 'token'
[riscv64] 195 | gwyhdf5_init(&ghfile, file_id, infobuf.token);
[riscv64] --
[riscv64] epflfile.c: In function 'load_file':
[riscv64] epflfile.c:162:14: error: too many arguments to function 'H5Oget_info1'; expected 2, have 3
[riscv64] 162 | status = H5Oget_info(file_id, &infobuf, H5O_INFO_BASIC);
[riscv64] --
[riscv64] 1862 | H5_DLL herr_t H5Oget_info1(hid_t loc_id, H5O_info1_t *oinfo);
[riscv64] epflfile.c:166:43: error: 'H5O_info1_t' has no member named 'token'
[riscv64] 166 | gwyhdf5_init(&ghfile, file_id, infobuf.token);
[riscv64] --
[riscv64] gwyhdf5.c: In function 'gwyhdf5_scan_file':
[riscv64] gwyhdf5.c:121:14: error: too many arguments to function 'H5Oget_info_by_name1'; expected 4, have 5
[riscv64] 121 | status = H5Oget_info_by_name(loc_id, name, &infobuf, H5O_INFO_BASIC | H5O_INFO_NUM_ATTRS, H5P_DEFAULT);
[riscv64] --
[riscv64] 1901 | H5_DLL herr_t H5Oget_info_by_name1(hid_t loc_id, const char *name, H5O_info1_t *oinfo, hid_t lapl_id);
[riscv64] gwyhdf5.c:128:43: error: 'H5O_info1_t' has no member named 'token'
[riscv64] 128 | if (H5Otoken_cmp(file_id, &infobuf.token, &g_array_index(tokens, H5O_token_t, i), &cmpval) < 0 || !cmpval)
2026-Jul-01 19:22:32 :: [riscv64] gwyddion3-3.11-alt1.src.rpm: remote: build failed
2026-Jul-01 19:22:32 :: [riscv64] #100 gwyddion3-3.11-alt1.src.rpm: build FAILED
2026-Jul-01 19:22:32 :: [riscv64] requesting cancellation of task processing
2026-Jul-01 19:22:32 :: [riscv64] build FAILED
2026-Jul-01 19:22:32 :: task #131025 for sisyphus_riscv64 FAILED
More information about the Riscv-reports
mailing list