[riscv-reports] [#130977] sisyphus_riscv64 FAILED srpm=python3-module-geopandas-1.1.4-alt1.src.rpm
Girar sisyphus_riscv64 awaiter recycler
noreply at basealt.ru
Wed Jul 1 19:14:50 MSK 2026
http://web.build.srt.basealt.ru/tasks/130977/logs/events.1.1.log
subtask name riscv64
#100 python3-module-geopandas failed
2026-Jul-01 16:02:18 :: shared task #130977 for sisyphus_riscv64 started by recycler:
2026-Jul-01 16:02:18 :: message: sync
#100 build python3-module-geopandas-1.1.4-alt1.src.rpm
2026-Jul-01 16:02:32 :: [riscv64] #100 python3-module-geopandas-1.1.4-alt1.src.rpm: build start
[riscv64] SKIPPED [1] geopandas/tools/tests/test_sjoin.py:947: Not implemented
[riscv64] FAILED geopandas/io/tests/test_arrow.py::test_pandas_parquet_roundtrip1 - Imp...
[riscv64] FAILED geopandas/io/tests/test_arrow.py::test_pandas_parquet_roundtrip2[naturalearth_lowres]
[riscv64] FAILED geopandas/io/tests/test_arrow.py::test_pandas_parquet_roundtrip2[naturalearth_cities]
[riscv64] FAILED geopandas/io/tests/test_arrow.py::test_pandas_parquet_roundtrip2[nybb_filename]
[riscv64] FAILED geopandas/io/tests/test_arrow.py::test_parquet_missing_metadata - Impo...
[riscv64] FAILED geopandas/io/tests/test_arrow.py::test_default_geo_col_writes - Import...
[riscv64] FAILED geopandas/io/tests/test_arrow.py::test_read_complex_type_with_numpy_backend_xfail[feather]
[riscv64] FAILED geopandas/io/tests/test_arrow.py::test_read_complex_type_with_numpy_backend_xfail[parquet]
[riscv64] FAILED geopandas/io/tests/test_arrow.py::test_read_versioned_file[0.1.0] - As...
[riscv64] FAILED geopandas/io/tests/test_arrow.py::test_read_versioned_file[0.4.0] - As...
[riscv64] FAILED geopandas/io/tests/test_arrow.py::test_read_versioned_file[1.0.0-beta.1]
2026-Jul-01 16:14:49 :: [riscv64] python3-module-geopandas-1.1.4-alt1.src.rpm: remote: build failed
2026-Jul-01 16:14:49 :: [riscv64] #100 python3-module-geopandas-1.1.4-alt1.src.rpm: build FAILED
2026-Jul-01 16:14:49 :: [riscv64] requesting cancellation of task processing
2026-Jul-01 16:14:50 :: [riscv64] build FAILED
2026-Jul-01 16:14:50 :: task #130977 for sisyphus_riscv64 FAILED
More information about the Riscv-reports
mailing list